program: Orca
programVersion: 5.0.2
elementType: C C C C C C C H H H C C H H O O O O O H C H H C H C H H H C H H H C H C C H H H C H H H C H C C H H H C H H H H Ag
elementType: Ag
charge: 1
multiplicity: 1
keywords: DLPNO-CCSD(T) def2-TZVPP def2-TZVPP/C VeryTightSCF
formula: C21H30O5Ag
InChI: InChI=1S/C21H30O5.Ag/c1-12(2)7-8-15-18(23)17(16(22)11-14(5)6)20(25)21(26,19(15)24)10-9-13(3)4;/h7,9,14-15,22,26H,8,10-11H2,1-6H3;
57 atoms
C  1.944887 0.055845 -1.750608
C  1.762435 -1.02602 -0.79216
C  0.472237 -1.661863 -0.696962
C  -0.556159 -1.411463 -1.798131
C  -0.586679 0.038493 -2.250817
C  0.702704 0.861794 -2.168032
C  -1.943244 -1.992559 -1.497013
H  -2.457565 -2.123968 -2.449492
H  -1.80676 -2.981264 -1.066057
H  -0.140337 -1.950596 -2.66228
C  2.800132 -1.459957 0.049638
C  4.208631 -0.999308 -0.015474
H  4.235467 0.062439 -0.254053
H  4.654776 -1.166172 0.966208
O  2.565942 -2.340786 0.971652
O  0.197724 -2.471672 0.195135
O  -1.597888 0.55044 -2.647608
O  3.007424 0.438431 -2.194572
O  0.917077 1.413932 -3.429178
H  1.875228 1.457149 -3.547904
C  0.480026 2.026934 -1.16185
H  1.386124 2.638783 -1.214784
H  -0.325807 2.619196 -1.591296
C  5.028443 -1.759439 -1.087651
H  4.519856 -1.62152 -2.044146
C  6.408861 -1.121153 -1.188556
H  6.948287 -1.200091 -0.241825
H  6.339133 -0.065906 -1.454974
H  7.005289 -1.620717 -1.951965
C  5.122576 -3.250514 -0.783852
H  5.598265 -3.426032 0.183517
H  5.721576 -3.751538 -1.544301
H  4.145475 -3.735697 -0.765518
C  -2.869944 -1.156368 -0.637808
H  -3.411244 -0.386159 -1.181114
C  -3.313358 -1.440209 0.622708
C  -2.845311 -2.613053 1.433962
H  -2.771617 -2.351169 2.489881
H  -3.598099 -3.402557 1.362347
H  -1.891036 -3.009279 1.101012
C  -4.510055 -0.713838 1.185324
H  -4.805651 0.142721 0.580498
H  -4.346893 -0.392075 2.214833
H  -5.352505 -1.409248 1.212195
C  0.242053 1.714888 0.293867
H  0.966484 1.054257 0.764677
C  -0.560987 2.425237 1.143054
C  -1.448833 3.553485 0.694897
H  -0.910967 4.495354 0.831769
H  -2.347299 3.61327 1.308821
H  -1.741858 3.488956 -0.350357
C  -0.390538 2.298405 2.636269
H  -1.347572 2.229002 3.154944
H  0.093449 3.206167 3.005299
H  0.233063 1.450288 2.916371
H  1.606576 -2.607915 0.913631
Ag -1.664953 0.380964 0.59303
totalener: -1333.37681526 hartree
nucrepener: 3074.57237754 hartree
electener: -4407.94919280 hartree
oneelecener: -7976.20184800 hartree
twoeener: 3568.25265520 hartree
kineticenergy: 1243.01932065 hartree
chargesum: 1.0000000
charge: 0.210317 -0.340050 0.284718 0.148899 0.039103 0.697302 -0.161230 0.131543 0.129016 0.133631 0.389948 -0.129530 0.101532 0.121614 -0.354693 -0.555729 -0.395209 -0.499276 -0.419312 0.250055 -0.215033 0.120427 0.131357 0.090488 0.048304 -0.234809 0.063427 0.076771 0.078327 -0.207916 0.065463 0.080659 0.055871 -0.241357 0.190586 0.114128 -0.210627 0.077216 0.115936 0.106926 -0.191068 0.080262 0.076097 0.115065 -0.304497 0.167617 0.141317 -0.201754 0.121423 0.089526 0.089730 -0.182825 0.077057 0.117664 0.078345 0.296409 0.340838
charge: -0.216715 -0.150994 -0.186475 -0.038706 -0.185962 -0.222494 0.026362 0.042471 0.034368 0.067548 -0.047285 0.019476 0.032719 0.037561 0.399444 0.106132 0.149931 0.095216 0.300633 -0.115795 0.020522 0.044612 0.041674 -0.079704 0.021466 0.032665 0.012160 0.011968 0.014997 0.027335 0.014321 0.015204 0.003510 -0.018566 0.037398 -0.065152 0.046880 0.022654 0.031867 0.017891 0.044826 0.023533 0.020334 0.033694 -0.013526 0.029383 -0.073498 0.051265 0.035584 0.025734 0.023018 0.047587 0.022810 0.034697 0.024182 -0.149279 0.418515
qa: 0.2103 -0.3400 0.2847 0.1489 0.0391 0.6973 -0.1612 0.1315 0.1290 0.1336 0.3899 -0.1295 0.1015 0.1216 -0.3547 -0.5557 -0.3952 -0.4993 -0.4193 0.2501 -0.2150 0.1204 0.1314 0.0905 0.0483 -0.2348 0.0634 0.0768 0.0783 -0.2079 0.0655 0.0807 0.0559 -0.2414 0.1906 0.1141 -0.2106 0.0772 0.1159 0.1069 -0.1911 0.0803 0.0761 0.1151 -0.3045 0.1676 0.1413 -0.2018 0.1214 0.0895 0.0897 -0.1828 0.0771 0.1177 0.0783 0.2964 0.3408
va: 3.9651 3.2569 3.8546 3.6343 4.0376 3.5468 4.0051 1.0053 1.0102 1.0130 3.8094 3.8431 1.0256 1.0174 2.1861 1.8738 2.0309 1.9313 2.0193 1.0156 3.9699 1.0157 1.0183 3.7623 1.0341 3.9764 1.0054 1.0045 1.0081 3.9586 1.0113 1.0058 1.0107 3.7599 1.0176 3.5647 3.9611 1.0085 1.0003 1.0030 3.9483 1.0069 1.0066 0.9999 3.7400 1.0111 3.5991 3.9528 0.9995 1.0068 1.0036 3.9500 1.0079 0.9993 1.0063 1.0292 1.3158
e0: -1333.376815206 hartree
corrType: DLPNO BASED
energy: -1339.026421656732
dipole: 130.15512 -131.57932 -1.42419 -43.24226 43.67586 0.43360 -49.96587 52.12700 2.16113
magnitude: 2.62428 au
magnitude: 6.67038 debye
