program: Orca
programVersion: 5.0.2
elementType: C C C C C C C H H H C C H H O O O O O H C H H C H C H H H C H H H C H C C H H H C H H H C H C C H H H C H H H H Ag
elementType: Ag
charge: 1
multiplicity: 1
keywords: DLPNO-CCSD(T) def2-TZVPP def2-TZVPP/C VeryTightSCF
formula: C21H30O5Ag
InChI: InChI=1S/C21H30O5.Ag/c1-12(2)7-8-15-18(23)17(16(22)11-14(5)6)20(25)21(26,19(15)24)10-9-13(3)4;/h7,9,14-15,22,26H,8,10-11H2,1-6H3;
57 atoms
C  2.013654 -0.219286 -1.672761
C  1.81427 -1.303679 -0.719812
C  0.539183 -1.970098 -0.668796
C  -0.563517 -1.579103 -1.647936
C  -0.542066 -0.110139 -2.02017
C  0.798118 0.623229 -2.094167
C  -1.954122 -2.045077 -1.207472
H  -2.667964 -1.743617 -1.969159
H  -1.951667 -3.135156 -1.175925
H  -0.298997 -2.100294 -2.57986
C  2.852183 -1.767664 0.106947
C  4.20551 -1.15736 0.211918
H  4.827628 -1.847296 0.782816
H  4.624083 -1.038639 -0.785097
O  2.649571 -2.757548 0.913018
O  0.308496 -2.902106 0.10797
O  -1.560924 0.496829 -2.237727
O  3.081097 0.119288 -2.139543
O  0.956948 1.020058 -3.424355
H  1.908027 1.036919 -3.593064
C  0.717911 1.888059 -1.199917
H  1.679077 2.399928 -1.309332
H  -0.035752 2.520491 -1.664174
C  4.176945 0.216488 0.916397
H  3.552029 0.885818 0.31769
C  3.590382 0.121913 2.321847
H  4.190766 -0.535304 2.95369
H  2.571209 -0.274902 2.323284
H  3.567222 1.104916 2.794164
C  5.585489 0.798592 0.939358
H  6.263587 0.156056 1.504757
H  5.589976 1.781565 1.411167
H  5.984216 0.90712 -0.069468
C  -2.395352 -1.583566 0.163761
H  -1.893262 -2.077089 0.992078
C  -3.524772 -0.875254 0.45996
C  -4.454185 -0.31753 -0.581592
H  -5.269611 -1.028329 -0.739197
H  -4.911963 0.610214 -0.238016
H  -3.967344 -0.133753 -1.535743
C  -4.045377 -0.828165 1.874829
H  -3.331054 -1.219522 2.598041
H  -4.946984 -1.443343 1.928621
H  -4.344731 0.178585 2.169587
C  0.468062 1.697213 0.273341
H  1.123513 0.992515 0.781436
C  -0.262665 2.52356 1.079264
C  -1.043884 3.703668 0.568865
H  -0.425377 4.599923 0.664755
H  -1.935592 3.873877 1.172134
H  -1.337606 3.614076 -0.474464
C  -0.099927 2.461382 2.577093
H  -1.057234 2.504858 3.097721
H  0.465672 3.339627 2.898366
H  0.445744 1.575891 2.90064
H  1.7036 -3.069393 0.792707
Ag -1.573169 0.564849 0.603856
totalener: -1333.37987479 hartree
nucrepener: 3119.03087105 hartree
electener: -4452.41074584 hartree
oneelecener: -8064.78754720 hartree
twoeener: 3612.37680136 hartree
kineticenergy: 1243.04286753 hartree
chargesum: 1.0000000
charge: 0.214760 -0.366366 0.314475 0.153764 0.045218 0.674428 -0.116482 0.126738 0.128987 0.135869 0.407265 -0.150234 0.126165 0.135145 -0.355473 -0.534182 -0.423796 -0.485488 -0.417497 0.249809 -0.192439 0.119059 0.131366 0.104186 -0.004224 -0.226245 0.092283 0.031639 0.079514 -0.229246 0.075617 0.072296 0.085048 -0.322787 0.189217 0.163709 -0.212354 0.118313 0.080542 0.103800 -0.185575 0.080062 0.115025 0.072232 -0.264664 0.125560 0.097807 -0.202486 0.120080 0.088176 0.091065 -0.181532 0.080096 0.117201 0.072475 0.299938 0.352143
charge: -0.219888 -0.153669 -0.182936 -0.036362 -0.173586 -0.220023 0.024599 0.035246 0.042058 0.068097 -0.043492 0.026724 0.039815 0.038016 0.399674 0.114815 0.144251 0.092985 0.297461 -0.111829 0.019102 0.043174 0.041103 -0.087351 0.014809 0.021956 0.020010 -0.002872 0.012255 0.035981 0.015196 0.012634 0.015395 -0.011835 0.034126 -0.069164 0.047896 0.032324 0.023852 0.022549 0.044901 0.023406 0.033800 0.020010 -0.013628 0.026914 -0.072383 0.050845 0.034885 0.025286 0.022993 0.046821 0.022385 0.033656 0.023213 -0.150152 0.403954
qa: 0.2148 -0.3664 0.3145 0.1538 0.0452 0.6744 -0.1165 0.1267 0.1290 0.1359 0.4073 -0.1502 0.1262 0.1351 -0.3555 -0.5342 -0.4238 -0.4855 -0.4175 0.2498 -0.1924 0.1191 0.1314 0.1042 -0.0042 -0.2262 0.0923 0.0316 0.0795 -0.2292 0.0756 0.0723 0.0850 -0.3228 0.1892 0.1637 -0.2124 0.1183 0.0805 0.1038 -0.1856 0.0801 0.1150 0.0722 -0.2647 0.1256 0.0978 -0.2025 0.1201 0.0882 0.0911 -0.1815 0.0801 0.1172 0.0725 0.2999 0.3521
va: 3.9948 3.1495 3.8937 3.6882 4.0264 3.5395 3.9656 1.0061 1.0141 1.0114 3.7608 3.8331 1.0173 1.0183 2.1933 1.9274 1.9742 1.9508 2.0139 1.0128 3.9335 1.0199 1.0173 3.7892 1.0287 3.9461 1.0154 1.0084 1.0050 3.9745 1.0067 1.0060 1.0045 3.7980 1.0150 3.5198 3.9496 0.9988 1.0089 1.0033 3.9500 1.0060 0.9993 1.0070 3.6928 1.0537 3.6488 3.9533 0.9990 1.0068 1.0027 3.9571 1.0095 0.9995 1.0056 1.0330 1.2992
e0: -1333.379874724 hartree
corrType: DLPNO BASED
energy: -1339.030674371777
dipole: 115.05420 -116.40955 -1.35536 -24.63391 25.42602 0.79211 -27.43812 29.20814 1.77002
magnitude: 2.36588 au
magnitude: 6.01359 debye
