program: Orca
programVersion: 5.0.2
elementType: C C C C C C C H H H C C H H O O O O O H C H H C H C H H H C H H H C H C C H H H C H H H C H C C H H H C H H H H Ag
elementType: Ag
charge: 1
multiplicity: 1
keywords: DLPNO-CCSD(T) def2-TZVPP def2-TZVPP/C VeryTightSCF
formula: C21H30O5Ag
InChI: InChI=1S/C21H30O5.Ag/c1-12(2)7-8-15-18(23)17(16(22)11-14(5)6)20(25)21(26,19(15)24)10-9-13(3)4;/h7,9,14-15,22,26H,8,10-11H2,1-6H3;
57 atoms
C  0.954748 -0.620352 1.054235
C  1.977298 0.420692 0.96683
C  1.58563 1.792154 1.194354
C  0.101508 2.123655 1.226356
C  -0.749399 1.079591 1.90171
C  -0.177444 -0.333641 2.069491
C  -0.323347 2.319198 -0.257908
H  0.20141 3.212364 -0.607758
H  0.063456 1.491904 -0.856208
H  -0.034988 3.064684 1.758842
C  3.315927 0.143428 0.679905
C  3.890812 -1.191097 0.363315
H  4.772121 -1.308056 0.997636
H  3.180567 -1.979953 0.592683
O  4.194815 1.098009 0.679661
O  2.377153 2.732559 1.214434
O  -1.842575 1.350485 2.345181
O  0.951843 -1.669927 0.450788
O  0.497738 -0.290273 3.317509
H  -0.141037 -0.147232 4.02086
C  -1.264639 -1.40613 2.074669
H  -0.764345 -2.348061 2.310104
H  -1.944456 -1.18146 2.894909
C  4.330114 -1.29474 -1.114364
H  5.087116 -0.524322 -1.282613
C  4.966182 -2.659252 -1.351722
H  4.240736 -3.45976 -1.189045
H  5.811371 -2.829639 -0.683733
H  5.328869 -2.742091 -2.376547
C  3.171097 -1.053217 -2.077133
H  3.511717 -1.140385 -3.109102
H  2.743386 -0.054666 -1.957156
H  2.374554 -1.781765 -1.916659
C  -1.800687 2.510708 -0.486757
H  -2.332112 3.063343 0.284116
C  -2.459627 2.284838 -1.659585
C  -1.791847 1.750573 -2.897755
H  -0.876555 1.196521 -2.70056
H  -2.469437 1.116858 -3.469322
H  -1.532388 2.594568 -3.542204
C  -3.853528 2.819177 -1.864731
H  -3.803708 3.668548 -2.550332
H  -4.308296 3.163997 -0.937276
H  -4.506757 2.082324 -2.333613
C  -2.02642 -1.633668 0.793919
H  -1.423084 -1.98686 -0.037752
C  -3.38368 -1.747667 0.678532
C  -3.99111 -2.392327 -0.543073
H  -3.270396 -2.520286 -1.349629
H  -4.356653 -3.383225 -0.262168
H  -4.856008 -1.840571 -0.913898
C  -4.338084 -1.515122 1.819217
H  -4.540912 -2.469553 2.311762
H  -5.295112 -1.14052 1.456318
H  -3.95653 -0.822985 2.566601
H  3.733281 1.955064 0.900643
Ag -2.732058 0.394366 -0.153637
totalener: -1333.37631637 hartree
nucrepener: 3046.71119985 hartree
electener: -4380.08751622 hartree
oneelecener: -7921.01715509 hartree
twoeener: 3540.92963887 hartree
kineticenergy: 1243.01668615 hartree
chargesum: 1.0000000
charge: 0.195247 -0.258133 0.172555 0.427490 -0.185425 0.757886 -0.298045 0.144835 0.097432 0.144518 0.388176 -0.167008 0.113547 0.097099 -0.366512 -0.492566 -0.420711 -0.488030 -0.403717 0.226519 -0.129023 0.130598 0.104075 0.121635 0.052450 -0.232860 0.061107 0.073258 0.074640 -0.242220 0.086687 0.038069 0.066470 -0.170045 0.169517 0.072713 -0.190558 0.078403 0.089625 0.121566 -0.178995 0.114037 0.083870 0.076825 -0.336791 0.197478 0.172708 -0.189586 0.082604 0.115115 0.074152 -0.213197 0.120339 0.086058 0.088790 0.294443 0.350884
charge: -0.211034 -0.149443 -0.185819 -0.024351 -0.181116 -0.209003 0.020682 0.047359 0.030421 0.056885 -0.050810 0.023681 0.040422 0.029168 0.394817 0.115754 0.124358 0.097351 0.302425 -0.111149 0.013925 0.049296 0.031124 -0.079218 0.023539 0.029940 0.011686 0.011571 0.013202 0.022367 0.012689 0.000650 0.011017 -0.008365 0.041239 -0.074332 0.048970 0.018473 0.025333 0.035004 0.047910 0.033173 0.025324 0.021572 -0.002061 0.035724 -0.078149 0.045326 0.024250 0.033820 0.020337 0.047286 0.032961 0.024994 0.021588 -0.142696 0.409930
qa: 0.1952 -0.2581 0.1726 0.4275 -0.1854 0.7579 -0.2980 0.1448 0.0974 0.1445 0.3882 -0.1670 0.1135 0.0971 -0.3665 -0.4926 -0.4207 -0.4880 -0.4037 0.2265 -0.1290 0.1306 0.1041 0.1216 0.0525 -0.2329 0.0611 0.0733 0.0746 -0.2422 0.0867 0.0381 0.0665 -0.1700 0.1695 0.0727 -0.1906 0.0784 0.0896 0.1216 -0.1790 0.1140 0.0839 0.0768 -0.3368 0.1975 0.1727 -0.1896 0.0826 0.1151 0.0742 -0.2132 0.1203 0.0861 0.0888 0.2944 0.3509
va: 3.8782 3.2535 4.1106 3.2925 4.1193 3.2464 3.9932 1.0065 0.9999 1.0266 3.8324 3.8819 1.0216 1.0333 2.1832 1.9928 1.9704 1.9246 2.0091 1.0187 3.9030 1.0179 1.0120 3.7768 1.0320 3.9721 1.0040 1.0060 1.0074 3.9866 1.0086 1.0021 1.0110 3.6488 1.0210 3.6791 3.9490 0.9999 1.0067 0.9995 3.9466 1.0001 1.0069 1.0058 3.7987 1.0117 3.5079 3.9493 1.0051 0.9986 1.0068 3.9538 0.9993 1.0087 1.0021 1.0343 1.3158
e0: -1333.376316478 hartree
corrType: DLPNO BASED
energy: -1339.021659705995
dipole: 153.16054 -156.20593 -3.04539 -24.24952 24.10425 -0.14526 9.45415 -10.59838 -1.14423
magnitude: 3.25649 au
magnitude: 8.27735 debye
