program: Orca
programVersion: 5.0.2
elementType: C C C C C C C H H H C C H H O O O O O H C H H C H C H H H C H H H C H C C H H H C H H H C H C C H H H C H H H H Ag
elementType: Ag
charge: 1
multiplicity: 1
keywords: DLPNO-CCSD(T) def2-TZVPP def2-TZVPP/C VeryTightSCF
formula: C21H30O5Ag
InChI: InChI=1S/C21H30O5.Ag/c1-12(2)7-8-15-18(23)17(16(22)11-14(5)6)20(25)21(26,19(15)24)10-9-13(3)4;/h7,9,14-15,22,26H,8,10-11H2,1-6H3;
57 atoms
C  2.006467 -0.244247 -1.614204
C  1.814285 -1.307124 -0.645859
C  0.446353 -1.735937 -0.336796
C  -0.54197 -1.597979 -1.499854
C  -0.445182 -0.273752 -2.218477
C  0.773543 0.608683 -1.973825
C  -1.978584 -2.032038 -1.205469
H  -2.529488 -2.018993 -2.142665
H  -1.943192 -3.070593 -0.869316
H  -0.148599 -2.295827 -2.254035
C  2.942613 -1.864992 -0.041806
C  2.952344 -2.875162 1.050032
H  1.973244 -3.331454 1.161871
H  3.676497 -3.640193 0.762835
O  4.131674 -1.50454 -0.418213
O  0.070267 -2.232131 0.702687
O  -1.293711 0.091807 -2.998575
O  3.098932 0.105547 -2.036081
O  1.01084 1.423901 -3.069254
H  0.303357 1.293475 -3.708292
C  0.543196 1.516512 -0.726642
H  0.536161 0.929826 0.192306
H  1.43686 2.147263 -0.687997
C  3.396469 -2.257785 2.395876
H  4.401179 -1.852135 2.251132
C  2.475945 -1.124922 2.841595
H  1.451319 -1.481536 2.96042
H  2.465747 -0.301388 2.123035
H  2.810534 -0.719723 3.796767
C  3.46578 -3.356508 3.449931
H  2.47968 -3.7942 3.621488
H  3.82265 -2.957129 4.399528
H  4.142481 -4.157404 3.149682
C  -2.718763 -1.2782 -0.130015
H  -2.286779 -1.363577 0.863975
C  -3.995578 -0.796594 -0.22233
C  -4.808224 -0.828841 -1.488969
H  -5.420061 -1.734554 -1.493484
H  -5.497405 0.014468 -1.530572
H  -4.202514 -0.825953 -2.392418
C  -4.770886 -0.453247 1.0258
H  -4.140303 -0.419296 1.913344
H  -5.526536 -1.226958 1.18343
H  -5.312477 0.488717 0.92942
C  -0.663537 2.408697 -0.842919
H  -0.912136 2.726733 -1.852167
C  -1.278159 3.056905 0.188754
C  -0.846992 2.92039 1.623762
H  -1.700133 2.969119 2.300182
H  -0.201453 3.767209 1.871285
H  -0.286994 2.010533 1.829587
C  -2.258647 4.167894 -0.083681
H  -1.782962 5.120008 0.163481
H  -3.144958 4.09267 0.54754
H  -2.56357 4.207308 -1.128274
H  4.045777 -0.825603 -1.143506
Ag -2.456915 1.018746 -0.364723
totalener: -1333.37831145 hartree
nucrepener: 3046.38539627 hartree
electener: -4379.76370772 hartree
oneelecener: -7920.01633849 hartree
twoeener: 3540.25263078 hartree
kineticenergy: 1243.00483118 hartree
chargesum: 1.0000000
charge: 0.156177 -0.293538 0.241303 0.208852 -0.094776 0.854545 -0.132747 0.130819 0.121398 0.132276 0.394946 -0.157031 0.097215 0.114655 -0.363791 -0.491890 -0.444495 -0.449111 -0.410964 0.238578 -0.287347 0.091155 0.148114 0.115259 0.054868 -0.244930 0.066959 0.038105 0.088959 -0.232278 0.061357 0.075356 0.073818 -0.293984 0.195973 0.155661 -0.210733 0.119821 0.085706 0.088939 -0.189000 0.081485 0.115193 0.076043 -0.245107 0.167657 0.123549 -0.188429 0.088878 0.123045 0.077265 -0.179485 0.114634 0.077222 0.084566 0.293135 0.336148
charge: -0.189806 -0.157498 -0.223429 -0.042207 -0.180676 -0.218007 0.021908 0.034716 0.045230 0.069927 -0.055727 0.022949 0.028108 0.039648 0.395404 0.087061 0.119062 0.141559 0.318917 -0.118161 0.018860 0.029494 0.052952 -0.078365 0.023865 0.022112 0.011068 0.000157 0.013050 0.030408 0.011747 0.013532 0.011795 -0.007161 0.036463 -0.078515 0.047700 0.033025 0.024989 0.022016 0.045294 0.024068 0.033998 0.020774 -0.009109 0.040647 -0.073783 0.049697 0.025399 0.035587 0.019131 0.048403 0.033610 0.021626 0.025403 -0.141074 0.422162
qa: 0.1562 -0.2935 0.2413 0.2089 -0.0948 0.8545 -0.1327 0.1308 0.1214 0.1323 0.3949 -0.1570 0.0972 0.1147 -0.3638 -0.4919 -0.4445 -0.4491 -0.4110 0.2386 -0.2873 0.0912 0.1481 0.1153 0.0549 -0.2449 0.0670 0.0381 0.0890 -0.2323 0.0614 0.0754 0.0738 -0.2940 0.1960 0.1557 -0.2107 0.1198 0.0857 0.0889 -0.1890 0.0815 0.1152 0.0760 -0.2451 0.1677 0.1235 -0.1884 0.0889 0.1230 0.0773 -0.1795 0.1146 0.0772 0.0846 0.2931 0.3361
va: 4.0392 3.2063 3.9491 3.5022 4.0971 3.2918 3.9648 1.0005 1.0121 1.0158 3.8224 3.8668 1.0340 1.0214 2.1869 1.9200 1.9525 2.0380 2.0408 1.0214 3.9354 1.0057 1.0111 3.7885 1.0316 3.9803 1.0113 1.0017 1.0087 3.9720 1.0039 1.0074 1.0061 3.8053 1.0151 3.5349 3.9578 0.9996 1.0084 1.0036 3.9487 1.0051 0.9987 1.0070 3.7149 1.0328 3.6031 3.9512 1.0071 0.9995 0.9975 3.9488 1.0004 1.0053 1.0055 1.0355 1.3375
e0: -1333.378311581 hartree
corrType: DLPNO BASED
energy: -1339.025095103527
dipole: 132.14809 -135.06140 -2.91331 -74.53816 75.27292 0.73476 27.44511 -26.47754 0.96757
magnitude: 3.15649 au
magnitude: 8.02316 debye
