program: Orca
programVersion: 5.0.2
elementType: C C C C C C C H H H C C H H O O O O O H C H H C H C H H H C H H H C H C C H H H C H H H C H C C H H H C H H H H Ag
elementType: Ag
charge: 1
multiplicity: 1
keywords: wB97X-D3 TightOpt Freq def2-TZVPP TightSCF defgrid3 CHELPG
frequency: 0.00 0.00 0.00 0.00 0.00 0.00 19.06 26.90 36.11 45.57 53.49 63.73 77.69 92.13 97.63 101.71 113.80 121.48 122.31 135.15 149.07 159.85 163.57 171.65 189.69 195.44 218.51 226.25 229.75 233.78 235.28 252.35 264.45 285.02 300.41 303.52 326.18 337.94 343.89 349.98 372.96 377.34 390.91 410.39 418.26 423.80 441.31 444.46 468.28 481.93 490.22 496.53 510.70 516.05 547.33 551.35 614.79 652.36 677.29 737.40 748.65 771.27 805.62 817.87 852.10 866.16 873.11 887.98 907.69 921.57 924.44 936.23 941.43 958.36 971.07 972.72 980.68 984.11 1005.18 1022.85 1029.88 1033.99 1044.52 1062.45 1065.84 1081.33 1101.12 1104.67 1122.71 1124.30 1135.63 1155.76 1173.12 1186.94 1200.12 1203.22 1217.87 1245.86 1249.43 1258.00 1273.72 1302.64 1319.89 1324.75 1331.77 1354.76 1371.66 1373.98 1375.98 1394.46 1402.40 1408.55 1419.15 1424.17 1426.03 1427.62 1435.40 1436.65 1437.39 1464.05 1467.43 1468.83 1475.76 1476.45 1487.05 1488.14 1488.29 1493.58 1497.29 1498.00 1504.75 1507.42 1509.99 1510.67 1514.93 1612.79 1655.30 1666.84 1707.92 1785.87 1822.40 3017.45 3051.41 3057.08 3057.69 3057.92 3060.01 3063.10 3064.18 3064.46 3095.50 3099.20 3115.11 3121.10 3123.80 3125.95 3130.55 3132.72 3133.23 3134.59 3138.53 3144.03 3149.71 3153.49 3158.34 3164.37 3166.28 3167.85 3171.23 3174.82 3730.89
frequency: 19.06 26.90 36.11 45.57 53.49 63.73 77.69 92.13 97.63 101.71 113.80 121.48 122.31 135.15 149.07 159.85 163.57 171.65 189.69 195.44 218.51 226.25 229.75 233.78 235.28 252.35 264.45 285.02 300.41 303.52 326.18 337.94 343.89 349.98 372.96 377.34 390.91 410.39 418.26 423.80 441.31 444.46 468.28 481.93 490.22 496.53 510.70 516.05 547.33 551.35 614.79 652.36 677.29 737.40 748.65 771.27 805.62 817.87 852.10 866.16 873.11 887.98 907.69 921.57 924.44 936.23 941.43 958.36 971.07 972.72 980.68 984.11 1005.18 1022.85 1029.88 1033.99 1044.52 1062.45 1065.84 1081.33 1101.12 1104.67 1122.71 1124.30 1135.63 1155.76 1173.12 1186.94 1200.12 1203.22 1217.87 1245.86 1249.43 1258.00 1273.72 1302.64 1319.89 1324.75 1331.77 1354.76 1371.66 1373.98 1375.98 1394.46 1402.40 1408.55 1419.15 1424.17 1426.03 1427.62 1435.40 1436.65 1437.39 1464.05 1467.43 1468.83 1475.76 1476.45 1487.05 1488.14 1488.29 1493.58 1497.29 1498.00 1504.75 1507.42 1509.99 1510.67 1514.93 1612.79 1655.30 1666.84 1707.92 1785.87 1822.40 3017.45 3051.41 3057.08 3057.69 3057.92 3060.01 3063.10 3064.18 3064.46 3095.50 3099.20 3115.11 3121.10 3123.80 3125.95 3130.55 3132.72 3133.23 3134.59 3138.53 3144.03 3149.71 3153.49 3158.34 3164.37 3166.28 3167.85 3171.23 3174.82 3730.89
formula: C21H30O5Ag
InChI: InChI=1S/C21H30O5.Ag/c1-12(2)7-8-15-18(23)17(16(22)11-14(5)6)20(25)21(26,19(15)24)10-9-13(3)4;/h7,9,14-15,22,26H,8,10-11H2,1-6H3;
57 atoms
C  2.065096 -0.227459 -1.745692
C  1.710868 -1.249666 -0.766126
C  0.379676 -1.80719 -0.799505
C  -0.484494 -1.549619 -2.026039
C  -0.311816 -0.176924 -2.647375
C  0.909092 0.653833 -2.259334
C  -1.953499 -1.951159 -1.875791
H  -2.416966 -1.898702 -2.857043
H  -1.98237 -2.995808 -1.559748
H  -0.045751 -2.217225 -2.783254
C  2.610425 -1.697454 0.208391
C  4.005133 -1.209231 0.37914
H  4.516816 -1.915331 1.034065
H  4.504302 -1.190264 -0.587068
O  2.23607 -2.56581 1.094595
O  -0.051919 -2.568769 0.068258
O  -1.140936 0.263037 -3.404414
O  3.178268 0.054277 -2.130212
O  1.317783 1.411203 -3.344683
H  2.280423 1.317705 -3.390561
C  0.524277 1.5950 -1.077761
H  0.344514 1.024288 -0.165291
H  1.418712 2.199045 -0.895074
C  4.058934 0.202989 1.004901
H  3.553249 0.890334 0.320779
C  3.35578 0.255942 2.357493
H  3.812253 -0.439138 3.064944
H  2.296137 0.000444 2.284754
H  3.42566 1.257015 2.783994
C  5.51438 0.642416 1.114809
H  6.073042 -0.022276 1.777143
H  5.582352 1.650925 1.523483
H  6.004046 0.639777 0.140611
C  -2.749732 -1.179299 -0.854843
H  -2.369889 -1.235444 0.163251
C  -4.02034 -0.704906 -1.018076
C  -4.773137 -0.779408 -2.319768
H  -5.371588 -1.693952 -2.330935
H  -5.470675 0.052623 -2.414495
H  -4.125923 -0.789515 -3.193924
C  -4.853971 -0.329538 0.182376
H  -4.264483 -0.263617 1.096037
H  -5.612941 -1.10197 0.329687
H  -5.3940 0.606335 0.033018
C  -0.620713 2.519323 -1.404164
H  -0.702379 2.798784 -2.451367
C  -1.376771 3.204093 -0.500613
C  -1.180513 3.105944 0.988206
H  -2.130982 3.160543 1.518853
H  -0.58958 3.965212 1.315881
H  -0.653607 2.207457 1.302493
C  -2.282376 4.319455 -0.954668
H  -1.8369 5.273395 -0.662484
H  -3.258769 4.27329 -0.470541
H  -2.417518 4.33001 -2.035018
H  1.276659 -2.787037 0.935743
Ag -2.498842 1.140782 -1.172786
totalener: -1341.21160511 hartree
nucrepener: 3161.95621099 hartree
electener: -4503.16781610 hartree
oneelecener: -8151.47307289 hartree
twoeener: 3648.30525679 hartree
kineticenergy: 1246.21910971 hartree
xcener: -125.368072963669 hartree
chargesum: 1.0000000
charge: 0.112897 -0.266982 0.174924 0.142669 -0.032064 0.612968 -0.193269 0.138091 0.133056 0.132041 0.290193 -0.152377 0.115145 0.134153 -0.227717 -0.403280 -0.286543 -0.344370 -0.343288 0.216898 -0.293250 0.107264 0.134417 -0.005005 0.045363 -0.248806 0.100874 0.068455 0.096812 -0.262504 0.093443 0.091255 0.100389 -0.217267 0.188412 0.095755 -0.223429 0.136641 0.102175 0.104870 -0.196990 0.094366 0.129743 0.097251 -0.181679 0.192956 0.056880 -0.210566 0.105308 0.135505 0.091038 -0.189877 0.126353 0.095263 0.102380 0.237318 0.145744
charge: -0.258889 -0.138163 -0.233032 -0.051671 -0.219042 -0.259430 0.011743 0.038517 0.049600 0.078311 -0.108837 0.010833 0.044230 0.039525 0.449099 0.170540 0.203477 0.168353 0.335541 -0.125619 0.004257 0.032409 0.052063 -0.099485 0.021126 0.012685 0.023408 0.005664 0.018481 0.022012 0.020069 0.018290 0.019403 -0.012761 0.040687 -0.099930 0.039359 0.039572 0.031988 0.027478 0.035516 0.028836 0.039932 0.028048 -0.012420 0.051645 -0.096263 0.037764 0.031451 0.040518 0.022178 0.038499 0.038330 0.027859 0.031849 -0.154395 0.388792
qa: 0.1129 -0.2670 0.1749 0.1427 -0.0321 0.6130 -0.1933 0.1381 0.1331 0.1320 0.2902 -0.1524 0.1151 0.1342 -0.2277 -0.4033 -0.2865 -0.3444 -0.3433 0.2169 -0.2932 0.1073 0.1344 -0.0050 0.0454 -0.2488 0.1009 0.0685 0.0968 -0.2625 0.0934 0.0913 0.1004 -0.2173 0.1884 0.0958 -0.2234 0.1366 0.1022 0.1049 -0.1970 0.0944 0.1297 0.0973 -0.1817 0.1930 0.0569 -0.2106 0.1053 0.1355 0.0910 -0.1899 0.1264 0.0953 0.1024 0.2373 0.1457
va: 4.0697 3.3907 4.0667 3.6443 3.8945 3.5508 4.0139 1.0025 1.0156 1.0039 3.8700 3.8110 1.0252 1.0216 2.3392 2.0962 2.1173 2.1195 2.1344 1.0587 3.8923 1.0102 1.0179 3.8748 1.0179 3.9131 1.0101 1.0102 1.0059 3.9513 1.0042 1.0066 1.0043 3.7794 1.0239 3.7008 3.9372 0.9950 1.0089 1.0102 3.9270 1.0083 0.9965 1.0050 3.6666 1.0347 3.7566 3.9346 1.0057 0.9968 1.0044 3.9341 0.9983 1.0040 1.0091 1.0950 1.6358
dispcorr: -0.035397822 hartree
energy: -1341.420612910091
dipole: 147.19504 -149.24698 -2.05194 -48.83556 49.57655 0.74099 37.37888 -36.28944 1.08944
magnitude: 2.43852 au
magnitude: 6.19824 debye
temp: 298.15 k
press: 1.00 atm
zeropoint: 0.48156410 hartree
thermalvibcorrection: 0.02728981 hartree
thermalrotcorrection: 0.00141627 hartree
thermaltrasncorrection: 0.00141627 hartree
thermaltotal: -1340.90892646 hartree
thermalcorr: 0.03012235 hartree
nonthermalcorr: 0.48156410 hartree
totalcorr: 0.51168645 hartree
thermalcorrenthalpy: 0.00094421 hartree
totalenthalpy: -1340.90798225 hartree
totalentropycorr: -0.08700139 hartree
gibbsenthalpy: -1340.99498364 hartree
gibbsminuselec: 0.42562927 hartree
