program: Gaussian 09
title: 000005761
version: EM64L-G09RevD.01
frameworkgroup: C1[X(C20H25N3O)]
method: RPBEPBE
basis: SDD
operation: Freq
keyword: #p
keyword: freq=noraman
keyword: PBEPBE/SDD
title: #p freq=noraman PBEPBE/SDD
converged: YES YES NO NO
title: Mulliken charges:
elementType: O N N N C C C C C C C C C C C C C C C C C C C C H H H H H H H H H H H H H H H H H H H H H H H H H
charge: -0.270312 -0.047937 -0.406005 -0.136182 -0.236237 0.302747 -0.601975 -0.228419 -0.534880 0.384561 0.250302 -0.173138 -0.386248 0.234887 -0.681007 0.193866 -0.448375 -0.430449 -0.370638 -0.207063 -0.346870 -0.384404 -0.663878 -0.650837 0.256531 0.234993 0.232963 0.235412 0.225364 0.257543 0.235725 0.247169 0.219912 0.207889 0.264507 0.232988 0.301253 0.226598 0.215443 0.199734 0.260786 0.221901 0.228789 0.252263 0.201995 0.215446 0.225609 0.220708 0.216971
chargesum: 0.00000
title: Mulliken charges with hydrogens summed into heavy atoms:
elementType: O N N N C C C C C C C C C C C C C C C C C C C C
charge: -0.270312 -0.047937 -0.104752 -0.136182 0.020294 0.302747 -0.134019 0.006993 -0.051973 0.384561 0.250302 -0.173138 -0.150523 0.234887 -0.006038 0.193866 -0.183867 -0.197460 -0.144040 0.008380 0.113650 0.066286 0.005826 0.012451
polarizability: 3.52152889e+02 2.24499456e+00 2.43493629e+02 1.21695579e+01 -8.00566593e+00 1.52311986e+02
1716.lowfreq: -9.6095 -0.0008 -0.0006 -0.0004 2.4665 7.2810 25.5606 28.9382 42.3322
frequency: 25.5234 28.9143 42.2258 55.4521 67.7842 79.9791 94.4633 120.4286 155.1963 166.3133 185.8239 198.3781 213.3232 216.8001 223.1976 235.7899 253.7709 282.6670 295.4198 319.7781 322.8345 326.7774 362.2197 386.5624 419.7674 422.1955 459.1736 473.9290 491.7574 494.8410 503.2996 521.8712 548.9910 567.7421 593.3265 598.7806 616.3161 625.3294 648.2399 683.8492 726.2389 737.7376 749.2277 767.9993 776.1967 777.8745 792.3384 804.5131 808.2514 828.1510 848.0376 859.7724 883.8031 914.2945 927.9111 946.6458 955.7206 982.5633 991.7393 1019.7300 1023.3010 1041.1332 1065.7421 1069.5333 1080.3304 1080.8078 1092.7914 1094.9049 1104.5836 1109.3485 1115.6431 1121.2833 1142.2567 1176.7492 1186.1131 1195.5830 1211.6130 1231.2099 1237.3185 1256.1961 1259.3438 1276.7727 1288.8103 1293.3783 1296.6258 1304.2050 1313.9205 1330.1943 1332.5311 1340.4913 1348.0171 1349.8052 1359.0006 1382.6507 1388.0162 1401.5894 1407.3586 1421.1317 1430.4962 1449.8844 1453.9957 1457.1079 1460.7103 1466.7694 1469.2900 1473.9043 1478.8168 1482.5372 1493.8623 1494.9029 1495.7249 1570.5890 1571.1313 1609.8737 1621.9716 1650.1247 2885.6773 2937.5287 2959.5106 2978.4037 2981.0687 2982.7831 2987.5533 2996.1148 3002.0178 3024.0539 3043.8388 3053.8022 3058.9627 3064.5398 3077.0668 3081.4150 3082.1444 3090.5163 3100.4685 3122.0278 3124.9981 3141.4931 3157.4399 3219.6972 3615.8005
redmass: 3.7033 4.3280 4.1445 3.0682 3.6404 3.1524 4.2152 3.5636 3.7991 3.0690 2.1451 3.8553 3.0385 1.1725 1.9520 1.4923 2.4311 1.6796 3.2172 3.5419 2.9586 3.0536 3.3935 3.3000 4.0146 2.6300 4.4393 2.6689 1.5287 3.7840 3.0610 2.8115 4.3410 4.6200 3.5586 3.4675 3.3951 3.9824 2.9311 7.5053 3.4373 4.8493 1.7550 1.5570 1.3829 1.3781 1.7465 3.7338 2.4207 4.2725 1.7824 3.1540 1.4499 3.1637 2.3444 2.6260 1.3326 2.5472 2.0893 2.2926 2.9109 2.5479 2.1577 2.0487 2.7636 1.9939 2.7724 1.9167 2.1968 2.1445 1.5465 1.9066 1.8093 1.2627 1.2903 1.7994 2.8852 1.6455 1.5478 1.7745 1.7367 1.4387 1.6511 1.8203 1.2392 1.3701 1.3726 1.5751 2.0449 1.2701 1.4946 1.6564 1.2933 1.2175 1.2125 3.1823 2.4115 3.0032 1.1469 3.3782 1.1240 1.1284 1.1719 1.0454 1.0435 1.0883 1.0578 1.0561 1.1595 2.8033 1.0504 6.1065 6.9066 8.3435 6.9898 8.5070 1.0538 1.0822 1.0800 1.0618 1.0361 1.0356 1.0593 1.0647 1.0645 1.0768 1.0993 1.1047 1.0973 1.0989 1.0994 1.0992 1.0983 1.1013 1.1017 1.0899 1.0861 1.0917 1.0982 1.0982 1.0808
irintensity: 1.1769 1.3585 1.5862 0.7815 1.7648 0.9422 0.3902 0.1484 1.0846 2.9026 0.2272 8.5592 2.7189 0.7280 1.7395 0.8028 4.8345 1.6196 1.6473 0.1923 3.1057 0.7984 18.8047 3.9662 4.3459 5.4204 1.0191 5.3604 78.1502 14.4516 22.6688 4.0344 0.8303 0.5959 1.7070 1.8213 1.3051 11.5947 2.6946 5.0653 4.8720 4.8769 47.7390 24.5841 47.6838 23.9614 5.2257 6.1229 20.4792 7.3057 8.8689 3.1855 0.1105 21.8786 1.9260 14.1316 1.2480 13.1208 9.5132 59.0494 3.1380 20.1376 43.1789 7.6642 1.1941 16.3261 0.9481 24.4664 13.6607 3.4522 2.3913 10.6893 101.2833 5.5970 4.6770 29.8360 30.9244 14.7103 51.5581 28.8366 18.7346 15.2753 1.5971 18.5990 9.4759 50.2822 7.0266 1.6484 9.0938 10.6211 10.6385 15.5269 10.6782 17.4812 26.6625 8.1131 155.7334 8.2129 10.8743 21.2725 22.1893 17.5303 21.6964 2.2069 12.0724 4.9264 8.4352 10.5072 12.3647 1.0555 18.3993 216.8253 2.4792 11.3893 5.7881 1.7861 71.4817 12.2253 34.9956 38.9845 27.5328 22.2416 54.0573 37.1965 50.6731 49.3795 25.4049 36.8000 4.4552 13.7038 37.4143 38.4437 46.9839 50.1629 34.1782 13.5650 0.6164 15.4854 32.3504 1.6547 67.1800
temp: 298.150 k
press: 1.00000 atm
elementType: 8 7 7 7 6 6 6 6 6 6 6 6 6 6 6 6 6 6 6 6 6 6 6 6 1 1 1 1 1 1 1 1 1 1 1 1 1 1 1 1 1 1 1 1 1 1 1 1 1
symmnumber: 1
zpe: 1082971.4 jmol-1
zpe.correction: 0.412482 hartree
zpe.thermalcorrener: 0.434745 hartree
zpe.thermalcorrenthalpy: 0.435689 hartree
zpe.thermalcorrgfe: 0.360822 hartree
zpe.sumelectzpe: -1014.830756 hartree
zpe.sumelectthermal: -1014.808493 hartree
zpe.sumelectthermalent: -1014.807549 hartree
zpe.sumelectthermalfe: -1014.882417 hartree
dipole: 0.4037 3.2776 1.9511
dipole: 3.8357
quadrupole: -96.3113 -142.1843 -148.2173
quadrupole: 3.5359 7.8576 -1.5543
quadrupole: 32.5930 -13.2800 -19.3130 3.5359 7.8576 -1.5543
hfenergy: -1015.2432383 hartree
pointgroup: C01 [X(C20H25N3O1)]
dipole: 0.1554954 -1.2304842 -0.8596681 debye
polarizability: 351.7937522|-0.6576482|244.1547194|-15.0209536|-1.5263263|152.0100324 unknown
InChI: InChI=1S/C20H25N3O/c1-4-23(5-2)20(24)14-9-16-15-7-6-8-17-19(15)13(11-21-17)10-18(16)22(3)12-14/h6-9,11,14,18,21H,4-5,10,12H2,1-3H3
charge 0 multiplicity 1
49 atoms
O  2.675377 1.766721 0.889721
N  0.43465 -2.179454 0.44119
N  -5.339921 -0.28575 0.269459
N  4.282004 0.421724 -0.11497
C  -0.806974 -1.360569 0.553813
C  -0.676327 0.041148 -0.114513
C  -2.066912 -2.171411 0.113211
C  1.852465 -0.215558 -0.287952
C  1.622968 -1.364352 0.762441
C  -3.289683 -1.29378 0.203788
C  -1.926963 0.840163 -0.182916
C  -3.132327 0.122485 0.016329
C  0.545308 0.535343 -0.472491
C  -4.415141 0.745725 0.050056
C  0.596667 -2.958322 -0.805835
C  2.958621 0.737003 0.192558
C  -4.6544 -1.520963 0.362431
C  -2.053618 2.239612 -0.359307
C  -4.537684 2.141651 -0.134049
C  -3.335816 2.862786 -0.341315
C  5.346278 1.328093 0.3849
C  4.715208 -0.73094 -0.935979
C  5.888921 0.896013 1.763589
C  4.855482 -0.391099 -2.437592
H  -0.94461 -1.154528 1.63849
H  -2.137923 -3.078236 0.7417
H  -1.942827 -2.506012 -0.935642
H  2.148758 -0.680111 -1.251647
H  2.508081 -2.025182 0.827641
H  1.474432 -0.89678 1.753791
H  0.623126 1.549987 -0.881519
H  -0.157661 -3.760804 -0.860299
H  1.589436 -3.44442 -0.783575
H  0.525318 -2.355187 -1.7428
H  -5.202328 -2.446907 0.528298
H  -1.163723 2.866736 -0.479791
H  -6.346402 -0.170641 0.359664
H  -5.503726 2.657653 -0.114749
H  -3.392879 3.949013 -0.477528
H  6.159679 1.351084 -0.365123
H  4.912788 2.339498 0.45998
H  5.689659 -1.076628 -0.540603
H  4.014573 -1.572299 -0.802081
H  5.080643 0.930784 2.513494
H  6.299659 -0.130634 1.735693
H  6.695554 1.577605 2.091447
H  3.882022 -0.097109 -2.86918
H  5.559346 0.446851 -2.588948
H  5.235224 -1.264203 -3.000077
