program: Orca
programVersion: 5.0.1
elementType: C C C C C C C H H H C C H H O O O O O H C H H C H C H H H C H H H C H C C H H H C H H H C H C C H H H C H H H H Ag
elementType: Ag
charge: 1
multiplicity: 1
keywords: wB97X-D3 def2-TZVPP defgrid3 ESD(ABS)
formula: C21H30O5Ag
InChI: InChI=1S/C21H30O5.Ag/c1-12(2)7-8-15-18(23)17(16(22)11-14(5)6)20(25)21(26,19(15)24)10-9-13(3)4;/h7,9,14-15,22,26H,8,10-11H2,1-6H3;
57 atoms
C  -2.016276 -0.823744 0.115627
C  -2.489123 0.49872 -0.291968
C  -1.610417 1.652542 -0.134162
C  -0.518231 1.5934 0.925802
C  -0.131052 0.18498 1.299064
C  -0.467507 -0.879447 0.252636
C  0.714811 2.487096 0.698122
H  0.342215 3.467869 0.391007
H  1.197419 2.620334 1.663848
H  -1.012269 1.995442 1.817505
C  -3.729581 0.682835 -0.916279
C  -4.797205 -0.344526 -1.016485
H  -5.473862 -0.039499 -1.815858
H  -4.351508 -1.306202 -1.266759
O  -4.036324 1.828382 -1.441519
O  -1.810191 2.723657 -0.701398
O  0.370812 -0.082792 2.358554
O  -2.662834 -1.834257 0.253417
O  0.076627 -0.409981 -0.984774
H  -0.424019 -0.771739 -1.719595
C  0.09172 -2.248718 0.60577
H  -0.375352 -2.581766 1.532125
H  -0.219506 -2.952719 -0.165327
C  -5.587616 -0.500746 0.303308
H  -4.870092 -0.762796 1.084543
C  -6.296905 0.791092 0.69502
H  -5.60074 1.616568 0.85352
H  -6.85452 0.650721 1.621105
H  -7.005151 1.099826 -0.076924
C  -6.571249 -1.655633 0.156932
H  -7.129777 -1.802498 1.081498
H  -6.055663 -2.588075 -0.075971
H  -7.293175 -1.457051 -0.638573
C  1.714295 2.059794 -0.345821
H  1.307351 1.905838 -1.341337
C  3.072207 2.136253 -0.236741
C  3.937926 2.092785 -1.473696
H  4.307383 3.101834 -1.672994
H  4.819744 1.464922 -1.338881
H  3.390662 1.760798 -2.355309
C  3.78815 2.550179 1.02199
H  4.753457 2.051072 1.103932
H  3.221975 2.355191 1.929813
H  3.991368 3.623155 0.97745
C  1.59487 -2.265148 0.802712
H  1.922072 -2.098196 1.824461
C  2.537087 -2.681508 -0.086273
C  3.951191 -2.949774 0.36629
H  4.110815 -4.030498 0.387668
H  4.148451 -2.564082 1.365578
H  4.688631 -2.543875 -0.327622
C  2.222648 -3.145364 -1.481262
H  2.95468 -2.769001 -2.196691
H  1.230659 -2.856959 -1.816685
H  2.289652 -4.235636 -1.513118
H  -3.266334 2.449255 -1.323183
Ag 2.480092 -0.196264 -0.045082
totalener: -1341.37718094 hartree
nucrepener: 3029.00864623 hartree
electener: -4370.38582718 hartree
oneelecener: -7888.79142801 hartree
twoeener: 3518.40560084 hartree
kineticenergy: 1245.33769146 hartree
xcener: -125.162592860020 hartree
chargesum: 1.0000000
charge: 0.060210 -0.285437 0.178356 0.129786 0.039554 0.555971 -0.230281 0.137042 0.141639 0.123340 0.265772 -0.127732 0.117453 0.109672 -0.227238 -0.379797 -0.267533 -0.329824 -0.361655 0.199027 -0.294067 0.136445 0.127671 -0.003602 0.066257 -0.243978 0.079677 0.096437 0.090021 -0.264491 0.093324 0.094813 0.086331 -0.179682 0.180410 0.081772 -0.195357 0.129149 0.095967 0.096593 -0.234103 0.102309 0.100770 0.135486 -0.094849 0.207451 0.033927 -0.197044 0.127219 0.098061 0.095374 -0.216078 0.100658 0.081627 0.135239 0.237251 0.164685
charge: -0.273469 -0.140007 -0.226159 -0.050672 -0.238804 -0.229190 0.015124 0.050286 0.039710 0.071921 -0.113802 0.006306 0.042251 0.036536 0.447360 0.175960 0.204496 0.167469 0.359701 -0.111751 0.004981 0.055564 0.040568 -0.096287 0.026408 0.015207 0.009407 0.019829 0.020343 0.019166 0.019418 0.016789 0.018044 -0.001759 0.040717 -0.103442 0.034435 0.039047 0.027547 0.029105 0.036836 0.031030 0.024556 0.038828 -0.006217 0.042277 -0.092507 0.035128 0.037972 0.029959 0.026792 0.035466 0.031373 0.016811 0.039613 -0.153121 0.356850
qa: 0.0602 -0.2854 0.1784 0.1298 0.0396 0.5560 -0.2303 0.1370 0.1416 0.1233 0.2658 -0.1277 0.1175 0.1097 -0.2272 -0.3798 -0.2675 -0.3298 -0.3617 0.1990 -0.2941 0.1364 0.1277 -0.0036 0.0663 -0.2440 0.0797 0.0964 0.0900 -0.2645 0.0933 0.0948 0.0863 -0.1797 0.1804 0.0818 -0.1954 0.1291 0.0960 0.0966 -0.2341 0.1023 0.1008 0.1355 -0.0948 0.2075 0.0339 -0.1970 0.1272 0.0981 0.0954 -0.2161 0.1007 0.0816 0.1352 0.2373 0.1647
va: 4.0783 3.4355 4.0618 3.7481 4.0069 3.2397 4.0138 1.0117 1.0025 1.0218 3.9280 3.8275 1.0238 1.0246 2.3357 2.1245 2.1843 2.1417 2.0528 1.0398 4.0952 1.0232 1.0119 3.8399 1.0226 3.9240 1.0095 1.0068 1.0082 3.9462 1.0081 1.0051 1.0037 3.7391 1.0291 3.6912 3.9156 0.9959 1.0053 1.0094 3.9553 1.0070 1.0097 0.9946 3.5646 1.0088 3.7417 3.9176 0.9979 1.0091 1.0030 3.9508 1.0075 1.0177 0.9978 1.0937 1.5760
energy: 31220.8 34007.8 37152.6 39824.0 42290.2 43883.2 45198.2 47334.6 47675.2 48264.8 48830.6 51259.2 51590.2 52470.6 53154.2
dispcorr: -0.034931336 hartree
energy: -1341.269859965377
dipole: -174.17700 176.80232 2.62532 8.09502 -8.34059 -0.24558 1.07793 -1.91805 -0.84011
magnitude: 2.76738 au
magnitude: 7.03412 debye
