program: Orca
programVersion: 5.0.2
elementType: C C C C C C C H H H C C H H O O O O O H C H H C H C H H H C H H H C H C C H H H C H H H C H C C H H H C H H H H Ag
elementType: Ag
charge: 1
multiplicity: 1
keywords: DLPNO-CCSD(T) def2-TZVPP def2-TZVPP/C VeryTightSCF
formula: C21H30O5Ag
InChI: InChI=1S/C21H30O5.Ag/c1-12(2)7-8-15-18(23)17(16(22)11-14(5)6)20(25)21(26,19(15)24)10-9-13(3)4;/h7,9,14-15,22,26H,8,10-11H2,1-6H3;
57 atoms
C  -2.084047 -0.600821 -0.633724
C  -2.599609 0.736238 -0.500721
C  -1.755621 1.832224 0.006178
C  -0.446209 1.487489 0.747911
C  -0.314966 0.000648 0.918377
C  -0.585708 -0.828933 -0.336475
C  0.720779 2.214004 0.02916
H  0.529399 2.180499 -1.039807
H  0.642164 3.266615 0.309683
H  -0.572494 1.899362 1.749706
C  -3.944477 0.957658 -0.865537
C  -4.649772 2.263682 -0.859882
H  -5.716518 2.052067 -0.771408
H  -4.322493 2.854524 -0.007777
O  -4.681306 -0.031479 -1.257371
O  -2.034063 3.005023 -0.085033
O  -0.14046 -0.526702 1.988027
O  -2.736316 -1.564802 -1.036901
O  0.152901 -0.236893 -1.403816
H  -0.191264 -0.552865 -2.242546
C  -0.226275 -2.301228 -0.162163
H  -0.886055 -2.728773 0.592001
H  -0.45479 -2.81586 -1.094853
C  -4.396328 3.077902 -2.15211
H  -3.317743 3.22421 -2.239799
C  -4.902951 2.355932 -3.396147
H  -4.401913 1.400207 -3.558134
H  -4.733355 2.968976 -4.281639
H  -5.975022 2.159065 -3.328365
C  -5.048323 4.447433 -2.000563
H  -4.868094 5.057606 -2.885887
H  -4.650661 4.981578 -1.13702
H  -6.129687 4.354626 -1.876145
C  2.167897 1.796381 0.222501
H  2.76639 1.977226 -0.66964
C  2.884145 1.571697 1.362432
C  4.392363 1.574366 1.321451
H  4.747836 2.48201 1.815346
H  4.816249 0.73664 1.876368
H  4.787526 1.57037 0.306353
C  2.300876 1.570158 2.744589
H  2.816584 0.857024 3.387306
H  1.239221 1.351924 2.777938
H  2.462685 2.560685 3.178785
C  1.201494 -2.556286 0.275985
H  1.335512 -2.652196 1.349734
C  2.256796 -2.909768 -0.508883
C  3.520842 -3.455329 0.1080
H  3.569107 -4.528829 -0.089702
H  3.55258 -3.314045 1.18754
H  4.415847 -3.019355 -0.337785
C  2.181536 -3.03591 -2.004458
H  3.062513 -2.605395 -2.481635
H  1.29665 -2.573658 -2.431645
H  2.17266 -4.096536 -2.267171
H  -4.130661 -0.864132 -1.265574
Ag 2.397437 -0.521746 0.130551
totalener: -1333.37162136 hartree
nucrepener: 3028.25147295 hartree
electener: -4361.62309431 hartree
oneelecener: -7884.50846019 hartree
twoeener: 3522.88536588 hartree
kineticenergy: 1243.03686094 hartree
chargesum: 1.0000000
charge: 0.112990 -0.247459 0.156765 0.309811 0.066039 0.689548 -0.236094 0.114140 0.131723 0.128440 0.354291 -0.141555 0.122119 0.111208 -0.348819 -0.473893 -0.396913 -0.505176 -0.473547 0.233559 -0.230720 0.134164 0.118234 0.085450 0.040424 -0.205686 0.050806 0.075601 0.067464 -0.235337 0.072637 0.078033 0.064544 -0.195084 0.161112 0.100969 -0.192067 0.114650 0.080570 0.075067 -0.189832 0.083410 0.090645 0.116706 -0.123680 0.177638 0.057629 -0.189800 0.112627 0.079944 0.076382 -0.187397 0.080199 0.066686 0.118474 0.292251 0.370112
charge: -0.186209 -0.148875 -0.210466 -0.035332 -0.205450 -0.198289 0.017173 0.032236 0.043799 0.049260 -0.036212 0.020979 0.038175 0.033735 0.404853 0.096498 0.145771 0.116544 0.311314 -0.110093 0.016757 0.049647 0.035634 -0.080809 0.019038 0.025215 0.001908 0.013044 0.014868 0.031783 0.012771 0.012400 0.012450 -0.022499 0.035931 -0.060312 0.045477 0.033356 0.021663 0.022253 0.054123 0.026966 0.018911 0.033583 -0.002354 0.037698 -0.071375 0.045327 0.032111 0.023812 0.020655 0.046408 0.024834 0.012163 0.033520 -0.150013 0.393646
qa: 0.1130 -0.2475 0.1568 0.3098 0.0660 0.6895 -0.2361 0.1141 0.1317 0.1284 0.3543 -0.1416 0.1221 0.1112 -0.3488 -0.4739 -0.3969 -0.5052 -0.4735 0.2336 -0.2307 0.1342 0.1182 0.0855 0.0404 -0.2057 0.0508 0.0756 0.0675 -0.2353 0.0726 0.0780 0.0645 -0.1951 0.1611 0.1010 -0.1921 0.1147 0.0806 0.0751 -0.1898 0.0834 0.0906 0.1167 -0.1237 0.1776 0.0576 -0.1898 0.1126 0.0799 0.0764 -0.1874 0.0802 0.0667 0.1185 0.2923 0.3701
va: 3.9889 3.2594 4.0195 3.6101 3.9934 3.3490 4.0023 1.0173 1.0119 1.0232 3.8357 3.8573 1.0166 1.0243 2.1914 1.9709 2.0330 1.9689 1.9064 1.0156 4.0281 1.0209 1.0197 3.7697 1.0333 3.9542 1.0108 1.0050 1.0120 3.9761 1.0075 1.0047 1.0060 3.7262 1.0117 3.5792 3.9567 1.0001 1.0047 1.0065 3.9525 1.0096 1.0176 0.9986 3.5812 1.0163 3.6748 3.9457 0.9999 1.0062 1.0053 3.9563 1.0105 1.0107 1.0012 1.0379 1.2716
e0: -1333.371621291 hartree
corrType: DLPNO BASED
energy: -1339.018514775698
dipole: -164.79914 167.85253 3.05340 59.06861 -59.90327 -0.83466 -31.04904 30.79128 -0.25776
magnitude: 3.17590 au
magnitude: 8.07249 debye
