program: Orca
programVersion: 5.0.2
elementType: C C C C C C C H H H C C H H O O O O O H C H H C H C H H H C H H H C H C C H H H C H H H C H C C H H H C H H H H Ag
elementType: Ag
charge: 1
multiplicity: 1
keywords: DLPNO-CCSD(T) def2-TZVPP def2-TZVPP/C VeryTightSCF
formula: C21H30O5Ag
InChI: InChI=1S/C21H30O5.Ag/c1-12(2)7-8-15-18(23)17(16(22)11-14(5)6)20(25)21(26,19(15)24)10-9-13(3)4;/h7,9,14-15,22,26H,8,10-11H2,1-6H3;
57 atoms
C  -2.018886 -0.718393 0.346556
C  -2.499241 0.518586 -0.267477
C  -1.662278 1.712154 -0.214679
C  -0.654002 1.832255 0.921344
C  -0.248692 0.500326 1.49401
C  -0.477757 -0.702016 0.575814
C  0.564417 2.743445 0.678823
H  0.201347 3.617996 0.132412
H  0.904177 3.095728 1.649923
H  -1.232994 2.316462 1.715844
C  -3.700945 0.574693 -0.983391
C  -4.737282 -0.488931 -0.999115
H  -5.369705 -0.320295 -1.871727
H  -4.255768 -1.462089 -1.083532
O  -4.000699 1.625896 -1.682381
O  -1.846628 2.689186 -0.934676
O  0.194888 0.395733 2.609371
O  -2.648242 -1.719868 0.588879
O  0.133721 -0.365434 -0.670075
H  -0.295943 -0.842522 -1.383564
C  0.098255 -1.98801 1.153217
H  -0.170647 -2.053432 2.204626
H  -0.384488 -2.83154 0.656177
C  -5.604381 -0.482237 0.281177
H  -4.931528 -0.615346 1.131745
C  -6.36004 0.831725 0.448674
H  -5.690254 1.689152 0.534589
H  -6.972739 0.803331 1.349873
H  -7.023357 1.014249 -0.39954
C  -6.55635 -1.671707 0.239671
H  -7.166445 -1.705985 1.142466
H  -6.010979 -2.613399 0.166647
H  -7.232984 -1.602136 -0.615164
C  1.71499 2.177392 -0.112903
H  1.460527 1.799555 -1.098829
C  3.040109 2.35119 0.161708
C  4.076814 2.11399 -0.910255
H  4.439497 3.083578 -1.260591
H  4.948206 1.5789 -0.530585
H  3.673618 1.580157 -1.769856
C  3.553524 3.046154 1.395797
H  4.513461 2.633382 1.705507
H  2.869458 2.99856 2.240032
H  3.725548 4.100249 1.163772
C  1.592689 -2.11101 0.943708
H  1.888269 -2.391995 -0.064326
C  2.567867 -2.165691 1.892731
C  3.957842 -2.624508 1.529247
H  4.725141 -1.979345 1.959205
H  4.109408 -2.69535 0.452721
H  4.11809 -3.617423 1.956205
C  2.314111 -2.020785 3.365371
H  2.299797 -3.017887 3.812968
H  1.377079 -1.522391 3.592569
H  3.125506 -1.475205 3.847845
H  -3.255323 2.281414 -1.607895
Ag 2.494751 0.076465 0.769806
totalener: -1333.38003610 hartree
nucrepener: 3023.85275127 hartree
electener: -4357.23278737 hartree
oneelecener: -7875.85982526 hartree
twoeener: 3518.62703789 hartree
kineticenergy: 1243.06403444 hartree
chargesum: 1.0000000
charge: 0.153957 -0.322840 0.234515 0.191484 0.035240 0.735541 -0.185953 0.134901 0.128467 0.119991 0.367511 -0.119957 0.122109 0.101591 -0.352776 -0.505143 -0.411833 -0.451871 -0.462052 0.226429 -0.215333 0.124520 0.129926 0.085874 0.039865 -0.209886 0.056036 0.077490 0.067526 -0.230680 0.074823 0.075334 0.064034 -0.230086 0.155884 0.108842 -0.177393 0.113665 0.072428 0.078225 -0.212364 0.086091 0.082581 0.118459 -0.105640 0.135546 0.051398 -0.189382 0.075686 0.076009 0.113176 -0.196624 0.115273 0.103934 0.076342 0.293882 0.375228
charge: -0.230054 -0.155769 -0.178018 -0.033128 -0.191449 -0.196034 0.026523 0.045406 0.033919 0.066025 -0.053633 0.020598 0.037466 0.033057 0.397868 0.107867 0.143427 0.104727 0.304159 -0.109510 0.018787 0.041842 0.041250 -0.082059 0.020667 0.027107 0.003964 0.013765 0.014816 0.031510 0.013594 0.011548 0.012321 0.007820 0.034484 -0.083788 0.044133 0.032436 0.020120 0.023748 0.045520 0.023778 0.018898 0.032529 -0.011092 0.030916 -0.062279 0.044176 0.020286 0.021787 0.032497 0.048099 0.031327 0.019357 0.023555 -0.139009 0.398143
qa: 0.1540 -0.3228 0.2345 0.1915 0.0352 0.7355 -0.1860 0.1349 0.1285 0.1200 0.3675 -0.1200 0.1221 0.1016 -0.3528 -0.5051 -0.4118 -0.4519 -0.4621 0.2264 -0.2153 0.1245 0.1299 0.0859 0.0399 -0.2099 0.0560 0.0775 0.0675 -0.2307 0.0748 0.0753 0.0640 -0.2301 0.1559 0.1088 -0.1774 0.1137 0.0724 0.0782 -0.2124 0.0861 0.0826 0.1185 -0.1056 0.1355 0.0514 -0.1894 0.0757 0.0760 0.1132 -0.1966 0.1153 0.1039 0.0763 0.2939 0.3752
va: 4.0175 3.2922 4.0375 3.6539 4.0996 3.1184 3.9794 1.0087 0.9978 1.0302 3.8454 3.8418 1.0172 1.0248 2.1860 1.9610 2.0096 1.9873 1.9448 1.0203 3.9762 1.0158 1.0189 3.7789 1.0316 3.9616 1.0094 1.0054 1.0116 3.9728 1.0079 1.0045 1.0063 3.7731 1.0254 3.6291 3.9436 0.9990 1.0064 1.0075 3.9610 1.0067 1.0031 0.9986 3.6710 1.0323 3.6465 3.9456 1.0050 1.0067 1.0001 3.9496 0.9993 1.0063 1.0082 1.0301 1.2499
e0: -1333.380036258 hartree
corrType: DLPNO BASED
energy: -1339.023232046622
dipole: -175.95064 178.83358 2.88295 4.20933 -4.44471 -0.23537 -12.60648 12.46986 -0.13662
magnitude: 2.89576 au
magnitude: 7.36045 debye
