program: Orca
programVersion: 5.0.1
elementType: C C C C C C C H H H C C H H O O O O O H C H H C H C H H H C H H H C H C C H H H C H H H C H C C H H H C H H H H Ag
elementType: Ag
charge: 1
multiplicity: 1
keywords: DLPNO-CCSD(T) def2-TZVPP def2-TZVPP/C VeryTightSCF
formula: C21H30O5Ag
InChI: InChI=1S/C21H30O5.Ag/c1-12(2)7-8-15-18(23)17(16(22)11-14(5)6)20(25)21(26,19(15)24)10-9-13(3)4;/h7,9,14-15,22,26H,8,10-11H2,1-6H3;
57 atoms
C  -0.670939 0.067734 0.349351
C  -1.371946 -0.810831 -0.566072
C  -0.65371 -1.29931 -1.717746
C  0.836801 -1.004345 -1.803636
C  1.19711 0.381741 -1.351443
C  0.335864 1.035995 -0.282226
C  1.576228 -2.019013 -0.871004
H  1.050647 -2.083087 0.082423
H  1.467692 -2.999474 -1.342428
H  1.170769 -1.142708 -2.830738
C  -2.694096 -1.223569 -0.352693
C  -3.509578 -0.813209 0.826336
H  -3.039697 -1.248204 1.713978
H  -3.359136 0.263668 0.950734
O  -3.27856 -1.966966 -1.232286
O  -1.161121 -2.024138 -2.571689
O  2.197676 0.937146 -1.742992
O  -0.825066 0.146532 1.552734
O  1.190575 1.501089 0.758566
H  0.672161 1.339957 1.569292
C  -0.425193 2.2047 -0.956567
H  0.346208 2.921761 -1.246567
H  -0.876674 1.837116 -1.878823
C  -4.999154 -1.164457 0.779657
H  -5.372456 -0.951814 -0.225826
C  -5.24439 -2.640302 1.084958
H  -6.307702 -2.872397 1.025319
H  -4.911037 -2.88172 2.097492
H  -4.723766 -3.296304 0.388717
C  -5.753179 -0.276975 1.766456
H  -5.386435 -0.422477 2.78526
H  -6.817444 -0.511421 1.761581
H  -5.644992 0.781001 1.519901
C  3.046304 -1.758009 -0.660573
H  3.600111 -1.452966 -1.545224
C  3.772961 -2.105775 0.438654
C  3.176163 -2.747818 1.662718
H  2.116886 -2.538895 1.7986
H  3.290762 -3.831682 1.58094
H  3.708423 -2.444963 2.563989
C  5.279581 -2.12365 0.379992
H  5.668641 -1.617401 -0.50218
H  5.613531 -3.163491 0.344321
H  5.728913 -1.686675 1.272319
C  -1.443051 2.84317 -0.064369
H  -1.039884 3.352522 0.805455
C  -2.764123 2.865086 -0.241033
C  -3.649682 3.582923 0.735694
H  -4.380919 2.897035 1.170742
H  -4.218669 4.367114 0.231576
H  -3.08185 4.036773 1.545568
C  -3.495481 2.231034 -1.389184
H  -3.98418 2.998832 -1.992583
H  -4.292554 1.582383 -1.016356
H  -2.863495 1.639713 -2.048281
H  -2.624402 -2.163105 -1.966327
Ag 3.215882 0.310004 0.579672
totalener: -1333.38120700 hartree
nucrepener: 3011.46133743 hartree
electener: -4344.84254443 hartree
oneelecener: -7850.82227980 hartree
twoeener: 3505.97973537 hartree
kineticenergy: 1243.19769406 hartree
chargesum: 1.0000000
charge: 0.199821 -0.296107 0.194450 0.406576 0.002830 0.717842 -0.319289 0.115273 0.143015 0.151999 0.268023 -0.102863 0.120126 0.086587 -0.357957 -0.484578 -0.415833 -0.495379 -0.553163 0.288602 -0.121409 0.125639 0.106263 0.171256 0.027009 -0.241501 0.079676 0.056222 0.077151 -0.205448 0.067455 0.083007 0.043389 -0.142633 0.171014 0.009544 -0.188599 0.079079 0.117901 0.093356 -0.164613 0.087016 0.110282 0.080518 -0.180243 0.075895 -0.025369 -0.156931 0.050601 0.086402 0.075350 -0.203164 0.109581 0.058454 0.059760 0.291963 0.566150
charge: -0.220256 -0.153601 -0.191823 -0.018604 -0.182086 -0.190462 0.027768 0.030484 0.046210 0.056097 -0.040817 0.014051 0.047901 0.045084 0.405212 0.117529 0.145911 0.094571 0.309611 -0.108382 0.011016 0.041567 0.029801 -0.088815 0.019938 0.027499 0.014293 0.009784 0.006163 0.028259 0.012956 0.015292 0.003026 0.000507 0.039769 -0.073526 0.046755 0.016942 0.033997 0.025422 0.047011 0.025056 0.032732 0.021242 -0.031239 0.014809 -0.080512 0.036336 0.012488 0.020994 0.017379 0.030813 0.024797 0.017239 0.005499 -0.136050 0.486362
qa: 0.1998 -0.2961 0.1944 0.4066 0.0028 0.7178 -0.3193 0.1153 0.1430 0.1520 0.2680 -0.1029 0.1201 0.0866 -0.3580 -0.4846 -0.4158 -0.4954 -0.5532 0.2886 -0.1214 0.1256 0.1063 0.1713 0.0270 -0.2415 0.0797 0.0562 0.0772 -0.2054 0.0675 0.0830 0.0434 -0.1426 0.1710 0.0095 -0.1886 0.0791 0.1179 0.0934 -0.1646 0.0870 0.1103 0.0805 -0.1802 0.0759 -0.0254 -0.1569 0.0506 0.0864 0.0753 -0.2032 0.1096 0.0585 0.0598 0.2920 0.5661
va: 4.0775 3.1957 4.0230 3.2944 4.0162 3.1304 3.9859 0.9867 1.0042 1.0191 3.8831 3.8818 1.0216 1.0190 2.1811 2.0009 1.9733 1.9451 1.8668 0.9906 3.8590 1.0238 1.0065 3.6917 1.0323 3.9732 1.0077 1.0074 1.0116 3.9607 1.0061 1.0087 1.0014 3.5658 1.0204 3.7249 3.9501 1.0014 0.9998 1.0055 3.9386 1.0051 0.9996 1.0042 3.7833 1.0265 3.7340 3.9659 0.9984 1.0023 1.0084 3.9745 1.0045 1.0001 1.0016 1.0422 0.8579
e0: -1333.381207095 hartree
corrType: DLPNO BASED
energy: -1339.011242777158
dipole: -242.65647 244.74673 2.09026 -33.64542 32.95258 -0.69284 -30.77302 31.71190 0.93888
magnitude: 2.39389 au
magnitude: 6.08479 debye
