program: Orca
programVersion: 5.0.1
elementType: C C C C C C C H H H C C H H O O O O O H C H H C H C H H H C H H H C H C C H H H C H H H C H C C H H H C H H H H Ag
elementType: Ag
charge: 1
multiplicity: 1
keywords: DLPNO-CCSD(T) def2-TZVPP def2-TZVPP/C VeryTightSCF
formula: C21H30O5Ag
InChI: InChI=1S/C21H30O5.Ag/c1-12(2)7-8-15-18(23)17(16(22)11-14(5)6)20(25)21(26,19(15)24)10-9-13(3)4;/h7,9,14-15,22,26H,8,10-11H2,1-6H3;/q-1;+1
57 atoms
C  1.007709 -0.096637 -0.202615
C  0.892196 -1.522965 -0.259163
C  -0.391938 -2.160447 -0.537522
C  -1.676851 -1.344007 -0.598882
C  -1.356754 0.070285 -0.968592
C  -0.280099 0.738423 -0.126871
C  -2.802694 -1.96336 -1.42743
H  -2.547403 -1.893089 -2.484915
H  -2.853675 -3.02311 -1.185931
H  -2.007135 -1.309247 0.448481
C  2.027994 -2.366911 -0.103387
C  3.403881 -1.905185 0.23901
H  3.793885 -1.436529 -0.672048
H  3.33233 -1.086013 0.956093
O  1.897855 -3.631728 -0.260942
O  -0.480639 -3.376036 -0.69808
O  -1.848598 0.688867 -1.875405
O  2.087923 0.506387 -0.184959
O  -0.072184 2.024582 -0.661096
H  -0.7234 2.114181 -1.3809
C  -0.705576 0.860169 1.359453
H  -0.665182 -0.127835 1.823205
H  0.060002 1.459175 1.853945
C  4.361774 -2.985807 0.745263
H  4.333236 -3.828671 0.052063
C  5.781369 -2.42571 0.760254
H  6.101954 -2.113328 -0.234976
H  6.486721 -3.176562 1.115431
H  5.856793 -1.562491 1.426504
C  3.956984 -3.479253 2.13228
H  3.989392 -2.661966 2.857531
H  4.642304 -4.252262 2.479137
H  2.953577 -3.905637 2.143024
C  -4.113387 -1.267938 -1.16348
H  -4.409806 -0.519943 -1.889667
C  -4.901113 -1.473872 -0.109587
C  -6.175747 -0.701088 0.067894
H  -7.03598 -1.374261 0.078259
H  -6.180776 -0.173903 1.025636
H  -6.321489 0.027878 -0.727532
C  -4.606957 -2.468385 0.977581
H  -3.729555 -3.082666 0.780105
H  -5.456035 -3.140492 1.116708
H  -4.460048 -1.958225 1.933983
C  -2.07456 1.452038 1.504159
H  -2.900296 0.764789 1.334742
C  -2.378012 2.71766 1.786328
C  -1.375083 3.804206 2.038703
H  -0.343418 3.459107 2.015465
H  -1.555902 4.266759 3.010854
H  -1.485432 4.593179 1.291279
C  -3.810751 3.153551 1.879776
H  -4.030604 3.534949 2.879285
H  -4.498605 2.338231 1.66265
H  -4.010649 3.968264 1.180348
H  0.924265 -3.822812 -0.49151
Ag 2.137213 2.726317 -0.570334
totalener: -1333.39889475 hartree
nucrepener: 2899.54315382 hartree
electener: -4232.94204857 hartree
oneelecener: -7628.66815319 hartree
twoeener: 3395.72610462 hartree
kineticenergy: 1243.30140744 hartree
chargesum: 1.0000000
charge: 0.378742 -0.323503 0.259684 0.105034 0.134401 0.726775 0.002973 0.105552 0.117168 0.092085 0.316829 -0.117282 0.104101 0.089459 -0.355838 -0.475504 -0.435410 -0.679553 -0.583203 0.288190 -0.173347 0.128982 0.097252 0.186016 0.032982 -0.216295 0.066446 0.083137 0.052157 -0.243728 0.054982 0.084693 0.071182 -0.166589 0.090218 -0.028565 -0.179967 0.086470 0.052168 0.076037 -0.204912 0.058107 0.095710 0.066895 -0.125436 0.054761 -0.030579 -0.175493 0.022472 0.096808 0.076088 -0.153758 0.080200 0.062837 0.072758 0.305154 0.793456
charge: -0.169259 -0.144954 -0.149880 -0.045023 -0.174416 -0.192842 0.010189 0.030910 0.029054 0.060716 -0.028566 0.010726 0.047687 0.038606 0.408638 0.161072 0.149355 0.067183 0.320505 -0.107391 0.005298 0.030061 0.030064 -0.086474 0.023059 0.028744 0.008096 0.016128 0.009211 0.026975 0.008542 0.016210 0.005857 -0.028408 0.013700 -0.092246 0.030058 0.018656 0.010814 0.016435 0.026849 0.009395 0.022740 0.013472 -0.041105 0.013321 -0.068130 0.034531 0.001890 0.023786 0.019821 0.039882 0.020125 0.016737 0.018508 -0.161571 0.596659
qa: 0.3787 -0.3235 0.2597 0.1050 0.1344 0.7268 0.0030 0.1056 0.1172 0.0921 0.3168 -0.1173 0.1041 0.0895 -0.3558 -0.4755 -0.4354 -0.6796 -0.5832 0.2882 -0.1733 0.1290 0.0973 0.1860 0.0330 -0.2163 0.0664 0.0831 0.0522 -0.2437 0.0550 0.0847 0.0712 -0.1666 0.0902 -0.0286 -0.1800 0.0865 0.0522 0.0760 -0.2049 0.0581 0.0957 0.0669 -0.1254 0.0548 -0.0306 -0.1755 0.0225 0.0968 0.0761 -0.1538 0.0802 0.0628 0.0728 0.3052 0.7935
va: 3.7862 3.3753 3.9412 3.9073 4.1058 3.3927 3.7590 1.0150 1.0217 1.0128 3.8919 3.8536 1.0218 1.0234 2.1870 2.0023 2.0196 1.6958 1.7815 0.9993 3.8483 0.9980 1.0167 3.7022 1.0347 3.9566 1.0056 1.0084 1.0055 3.9736 1.0071 1.0083 1.0101 3.7390 1.0260 3.6976 3.9609 1.0035 0.9985 1.0055 3.9466 1.0091 1.0053 1.0011 3.6648 1.0207 3.8114 3.9509 1.0079 1.0066 1.0041 3.9629 1.0030 1.0055 1.0033 1.0436 0.3325
e0: -1333.398894729 hartree
corrType: DLPNO BASED
energy: -1339.002449286007
dipole: -158.18237 159.77683 1.59446 -192.20067 194.26805 2.06738 60.44878 -59.98941 0.45937
magnitude: 2.65092 au
magnitude: 6.73810 debye
