program: Orca
programVersion: 5.0.1
elementType: C C C C C C C H H H C C H H O O O O O H C H H C H C H H H C H H H C H C C H H H C H H H C H C C H H H C H H H H Ag
elementType: Ag
charge: 1
multiplicity: 1
keywords: DLPNO-CCSD(T) def2-TZVPP def2-TZVPP/C VeryTightSCF
formula: C21H30O5Ag
InChI: InChI=1S/C21H30O5.Ag/c1-12(2)7-8-15-18(23)17(16(22)11-14(5)6)20(25)21(26,19(15)24)10-9-13(3)4;/h7,9,14-15,22,26H,8,10-11H2,1-6H3;/q-1;+1
57 atoms
C  0.232795 -0.613048 0.75668
C  1.256987 -0.430681 -0.230639
C  0.871386 -0.176668 -1.603228
C  -0.544786 0.256038 -1.943687
C  -1.573314 -0.04482 -0.893256
C  -1.186098 -0.952273 0.24965
C  -0.533927 1.775993 -2.270162
H  0.140578 1.914752 -3.110999
H  -1.53462 2.043365 -2.609451
H  -0.838321 -0.282313 -2.848771
C  2.624048 -0.524391 0.081236
C  3.179115 -0.661299 1.450203
H  2.548015 -1.333957 2.028462
H  4.178864 -1.088729 1.362923
O  3.503711 -0.477773 -0.864303
O  1.689961 -0.165391 -2.522573
O  -2.692626 0.43305 -0.96567
O  0.346763 -0.590884 1.972384
O  -2.052789 -0.776682 1.348057
H  -1.443366 -0.679705 2.110826
C  -1.274773 -2.451572 -0.185213
H  -0.894528 -3.021208 0.662359
H  -2.345784 -2.660077 -0.242965
C  3.25753 0.698524 2.184851
H  2.270352 1.164483 2.122028
C  3.573081 0.452431 3.655289
H  4.533705 -0.054777 3.76987
H  2.805128 -0.162268 4.126142
H  3.630607 1.395728 4.19885
C  4.283202 1.625189 1.541764
H  5.284489 1.191819 1.585727
H  4.313468 2.581423 2.065155
H  4.059844 1.827363 0.493166
C  -0.143014 2.612738 -1.087117
H  -0.901437 2.708947 -0.312532
C  1.016125 3.238736 -0.885663
C  2.168897 3.237757 -1.846189
H  3.067023 2.856323 -1.354605
H  1.999383 2.641101 -2.738483
H  2.398477 4.259595 -2.155226
C  1.249501 4.031452 0.367658
H  2.122392 3.651733 0.904261
H  0.391903 3.999991 1.038145
H  1.460344 5.075871 0.128018
C  -0.619844 -2.849044 -1.471817
H  -1.193785 -2.649042 -2.371982
C  0.557599 -3.457995 -1.618338
C  1.073672 -3.802022 -2.983088
H  2.001682 -3.260156 -3.181589
H  0.359441 -3.553018 -3.76573
H  1.306658 -4.866359 -3.051882
C  1.466523 -3.840838 -0.489017
H  1.59833 -4.924556 -0.468352
H  1.114129 -3.526157 0.491132
H  2.459874 -3.414052 -0.647548
H  3.015193 -0.363235 -1.737524
Ag -4.053663 0.270992 0.873852
totalener: -1333.39298026 hartree
nucrepener: 3063.16564558 hartree
electener: -4396.55862584 hartree
oneelecener: -7955.82089326 hartree
twoeener: 3559.26226743 hartree
kineticenergy: 1243.33846069 hartree
chargesum: 1.0000000
charge: 0.223697 -0.254365 0.243414 0.300385 0.068034 0.812613 -0.085150 0.123141 0.110600 0.110110 0.357431 -0.125916 0.106048 0.123750 -0.364149 -0.515903 -0.565695 -0.540817 -0.595165 0.299633 -0.159282 0.112856 0.109305 0.112476 0.021765 -0.239367 0.069317 0.074905 0.075123 -0.218085 0.084091 0.077340 0.042932 -0.209315 0.057876 -0.008351 -0.185165 0.059628 0.079599 0.097145 -0.163556 0.052888 0.064149 0.091727 -0.265628 0.082427 0.092033 -0.191253 0.079391 0.071210 0.092465 -0.239946 0.113947 0.060535 0.073756 0.302766 0.796598
charge: -0.205538 -0.142089 -0.174542 -0.030435 -0.121259 -0.188915 0.017766 0.031696 0.029801 0.057429 -0.050728 0.021665 0.032759 0.038606 0.397014 0.130967 0.127559 0.087347 0.305547 -0.116079 0.012865 0.035841 0.034665 -0.082379 0.019256 0.032401 0.013724 0.011155 0.013448 0.023698 0.016279 0.012422 0.001970 -0.046828 0.005576 -0.074177 0.034191 0.015092 0.011294 0.022865 0.033910 0.016126 0.012644 0.020978 -0.047432 0.010344 -0.064218 0.040035 0.020037 0.017844 0.021702 0.035201 0.026484 0.008178 0.021396 -0.149694 0.614533
qa: 0.2237 -0.2544 0.2434 0.3004 0.0680 0.8126 -0.0851 0.1231 0.1106 0.1101 0.3574 -0.1259 0.1060 0.1237 -0.3641 -0.5159 -0.5657 -0.5408 -0.5952 0.2996 -0.1593 0.1129 0.1093 0.1125 0.0218 -0.2394 0.0693 0.0749 0.0751 -0.2181 0.0841 0.0773 0.0429 -0.2093 0.0579 -0.0084 -0.1852 0.0596 0.0796 0.0971 -0.1636 0.0529 0.0641 0.0917 -0.2656 0.0824 0.0920 -0.1913 0.0794 0.0712 0.0925 -0.2399 0.1139 0.0605 0.0738 0.3028 0.7966
va: 3.9257 3.2815 4.0255 3.6274 3.9961 3.1628 3.8313 1.0117 1.0194 1.0342 3.7630 3.8497 1.0208 1.0187 2.1690 1.9383 1.8438 1.9045 1.7848 0.9982 3.8886 1.0196 1.0105 3.7523 1.0388 3.9764 1.0058 1.0050 1.0071 3.9611 1.0155 1.0022 1.0016 3.7212 1.0209 3.6899 3.9609 0.9985 1.0077 1.0035 3.9538 0.9958 1.0058 1.0060 3.7285 1.0170 3.6405 3.9584 1.0062 1.0071 1.0016 4.0018 1.0044 1.0042 1.0040 1.0327 0.3315
e0: -1333.392980215 hartree
corrType: DLPNO BASED
energy: -1339.009405780397
dipole: 302.18699 -304.51555 -2.32857 -17.87370 17.61193 -0.26177 -61.91968 62.65874 0.73906
magnitude: 2.45702 au
magnitude: 6.24526 debye
