program: Orca
programVersion: 5.0.1
elementType: C C C C C C C H H H C C H H O O O O O H C H H C H C H H H C H H H C H C C H H H C H H H C H C C H H H C H H H H Ag
elementType: Ag
charge: 1
multiplicity: 1
keywords: DLPNO-CCSD(T) def2-TZVPP def2-TZVPP/C VeryTightSCF
formula: C21H30O5Ag
InChI: InChI=1S/C21H30O5.Ag/c1-12(2)7-8-15-18(23)17(16(22)11-14(5)6)20(25)21(26,19(15)24)10-9-13(3)4;/h7,9,14-15,22,26H,8,10-11H2,1-6H3;
57 atoms
C  0.041103 -0.275246 -0.387965
C  1.260685 0.184927 0.170943
C  1.845927 -0.606529 1.284265
C  1.70086 -2.113308 1.153496
C  0.330487 -2.536305 0.724383
C  -0.660446 -1.449355 0.293247
C  2.694602 -2.629965 0.062735
H  2.708125 -3.717601 0.147611
H  2.292661 -2.400778 -0.924698
H  1.946834 -2.56873 2.112943
C  1.860512 1.348163 -0.329832
C  3.086972 1.987921 0.208523
H  3.601921 1.289913 0.8609
H  3.725642 2.219527 -0.646503
O  1.351718 1.952787 -1.361521
O  2.445485 -0.127744 2.21349
O  -0.033749 -3.681049 0.647253
O  -0.555846 0.291535 -1.331235
O  -1.585996 -2.024478 -0.588516
H  -1.525095 -2.984687 -0.466238
C  -1.405887 -0.931745 1.560473
H  -1.87917 -1.80178 2.014056
H  -0.681604 -0.546873 2.282048
C  2.801858 3.306271 0.982593
H  3.7464 3.528349 1.484625
C  2.479378 4.476211 0.058989
H  3.248237 4.611624 -0.702662
H  2.41602 5.399004 0.636409
H  1.524984 4.340094 -0.451098
C  1.73173 3.132516 2.056099
H  1.961735 2.304879 2.72519
H  0.750562 2.946236 1.607135
H  1.644096 4.042552 2.649426
C  4.065331 -2.057058 0.235066
H  4.542828 -2.28288 1.18412
C  4.736654 -1.304295 -0.635826
C  6.116434 -0.80954 -0.310616
H  6.838082 -1.166864 -1.048637
H  6.151114 0.282635 -0.342647
H  6.444105 -1.134381 0.675073
C  4.236264 -0.894916 -1.991667
H  4.340861 0.184623 -2.12441
H  3.197655 -1.158841 -2.179778
H  4.843718 -1.359013 -2.771746
C  -2.410744 0.159027 1.282034
H  -2.000117 1.164063 1.214407
C  -3.762698 0.048962 1.337421
C  -4.62872 1.281172 1.347081
H  -4.07091 2.184825 1.105487
H  -5.050453 1.40441 2.34748
H  -5.475492 1.189721 0.666049
C  -4.486391 -1.239712 1.612241
H  -4.799583 -1.254258 2.659185
H  -3.885142 -2.125442 1.424163
H  -5.396594 -1.309009 1.016375
H  0.527002 1.483039 -1.637588
Ag -2.90975 -0.054807 -1.111042
totalener: -1333.38806882 hartree
nucrepener: 3023.04222560 hartree
electener: -4356.43029442 hartree
oneelecener: -7874.63506098 hartree
twoeener: 3518.20476656 hartree
kineticenergy: 1243.25097543 hartree
chargesum: 1.0000000
charge: 0.198219 -0.271181 0.172173 0.358168 -0.010526 0.843002 -0.145868 0.125404 0.086004 0.141385 0.352104 -0.135220 0.124369 0.105560 -0.356917 -0.431089 -0.427362 -0.649458 -0.506868 0.262860 -0.335460 0.135659 0.148947 0.123432 0.045504 -0.223185 0.069320 0.079241 0.055710 -0.237895 0.101608 0.015511 0.090217 -0.101147 0.079417 -0.055281 -0.175592 0.084773 0.057233 0.078876 -0.213379 0.062875 0.054126 0.107512 -0.138481 0.146818 -0.016924 -0.167113 0.080296 0.111278 0.080795 -0.186462 0.117764 0.080397 0.089749 0.286537 0.632562
charge: -0.161197 -0.133182 -0.228534 -0.034283 -0.178435 -0.202484 0.015974 0.035097 0.020332 0.053788 -0.036674 0.024809 0.033557 0.036793 0.409808 0.115615 0.130471 0.089964 0.320502 -0.103451 0.025812 0.039371 0.042474 -0.070477 0.028333 0.026090 0.010714 0.013769 0.004336 0.025091 0.013102 0.000316 0.014321 -0.026449 0.019467 -0.085048 0.034245 0.019544 0.012042 0.018384 0.027747 0.013893 0.003274 0.023653 -0.011196 0.031111 -0.058750 0.046296 0.022783 0.032615 0.020955 0.046989 0.033345 0.016589 0.025388 -0.140753 0.492153
qa: 0.1982 -0.2712 0.1722 0.3582 -0.0105 0.8430 -0.1459 0.1254 0.0860 0.1414 0.3521 -0.1352 0.1244 0.1056 -0.3569 -0.4311 -0.4274 -0.6495 -0.5069 0.2629 -0.3355 0.1357 0.1489 0.1234 0.0455 -0.2232 0.0693 0.0792 0.0557 -0.2379 0.1016 0.0155 0.0902 -0.1011 0.0794 -0.0553 -0.1756 0.0848 0.0572 0.0789 -0.2134 0.0629 0.0541 0.1075 -0.1385 0.1468 -0.0169 -0.1671 0.0803 0.1113 0.0808 -0.1865 0.1178 0.0804 0.0897 0.2865 0.6326
va: 3.8485 3.3091 4.0054 3.3490 4.0753 3.1518 3.9308 1.0152 1.0065 1.0220 3.8335 3.8461 1.0226 1.0151 2.1848 1.9873 2.0180 1.7444 1.8404 1.0156 4.0311 1.0129 0.9998 3.8328 1.0170 3.9816 1.0084 1.0067 1.0094 3.9750 1.0111 1.0040 1.0090 3.7402 1.0239 3.7330 3.9597 1.0017 1.0004 1.0075 3.9701 0.9993 1.0002 1.0030 3.5592 1.0219 3.7056 3.9369 1.0055 1.0009 1.0037 3.9496 1.0001 1.0082 1.0054 1.0275 0.6927
e0: -1333.388068857 hartree
corrType: DLPNO BASED
energy: -1339.012235823035
dipole: 221.88552 -224.39859 -2.51307 10.60110 -10.11099 0.49011 89.21847 -89.46596 -0.24749
magnitude: 2.57235 au
magnitude: 6.53838 debye
