program: Orca
programVersion: 5.0.1
elementType: C C C C C C C H H H C C H H O O O O O H C H H C H C H H H C H H H C H C C H H H C H H H C H C C H H H C H H H H Ag
elementType: Ag
charge: 1
multiplicity: 1
keywords: DLPNO-CCSD(T) def2-TZVPP def2-TZVPP/C VeryTightSCF
formula: C21H30O5Ag
InChI: InChI=1S/C21H30O5.Ag/c1-12(2)7-8-15-18(23)17(16(22)11-14(5)6)20(25)21(26,19(15)24)10-9-13(3)4;/h7,9,14-15,22,26H,8,10-11H2,1-6H3;
57 atoms
C  1.07847 -0.455954 -0.356696
C  2.116576 -0.736991 0.613842
C  1.725868 -0.911205 1.997111
C  0.261927 -1.021837 2.373969
C  -0.695058 -0.314692 1.463006
C  -0.173053 0.275037 0.167224
C  -0.148182 -2.530447 2.395532
H  0.522233 -3.028899 3.095938
H  -1.151773 -2.582325 2.812309
H  0.144775 -0.627829 3.384854
C  3.465986 -0.924169 0.267943
C  4.040584 -0.850005 -1.104144
H  4.811621 -1.620147 -1.155176
H  3.271656 -1.072699 -1.836445
O  4.335332 -1.167344 1.19258
O  2.546425 -1.093378 2.898313
O  -1.86622 -0.193028 1.766147
O  1.093364 -0.663678 -1.553855
O  -1.160872 0.209697 -0.820385
H  -0.713784 -0.150342 -1.608262
C  0.214889 1.764548 0.453336
H  0.939468 2.056072 -0.308782
H  0.732915 1.834197 1.410361
C  4.691444 0.518703 -1.437033
H  5.037683 0.402065 -2.466873
C  3.682929 1.663038 -1.413691
H  2.821998 1.453494 -2.050673
H  4.14646 2.584026 -1.76719
H  3.329686 1.85221 -0.395688
C  5.904187 0.834505 -0.568535
H  5.622572 1.023135 0.468708
H  6.406787 1.727902 -0.940171
H  6.626077 0.017683 -0.571961
C  -0.066688 -3.166503 1.037305
H  0.933558 -3.428076 0.70523
C  -1.072712 -3.428646 0.201421
C  -0.802289 -4.040608 -1.142385
H  -1.315831 -4.999541 -1.239166
H  -1.18347 -3.397859 -1.939878
H  0.261004 -4.200005 -1.311827
C  -2.523236 -3.169521 0.487023
H  -2.710769 -2.758043 1.475453
H  -3.092018 -4.09628 0.389796
H  -2.929911 -2.474918 -0.252763
C  -0.935889 2.741187 0.374365
H  -1.148403 3.110105 -0.62563
C  -1.546432 3.37236 1.405936
C  -2.460564 4.542604 1.159412
H  -3.393639 4.453127 1.71724
H  -2.686532 4.680332 0.102902
H  -1.973231 5.451763 1.519366
C  -1.24403 3.100982 2.850813
H  -0.653358 2.203376 3.013941
H  -2.163921 3.011491 3.429327
H  -0.696408 3.950537 3.265548
H  3.85944 -1.177224 2.079448
Ag -2.971271 1.364601 0.37013
totalener: -1333.39147612 hartree
nucrepener: 3052.91910959 hartree
electener: -4386.31058570 hartree
oneelecener: -7934.53386322 hartree
twoeener: 3548.22327751 hartree
kineticenergy: 1243.26889649 hartree
chargesum: 1.0000000
charge: 0.405898 -0.375683 0.174094 0.313236 -0.016316 0.849534 -0.163297 0.136334 0.111738 0.120726 0.365720 -0.137591 0.121949 0.126572 -0.362355 -0.487279 -0.531685 -0.522509 -0.527388 0.266157 -0.310202 0.117118 0.131759 0.116843 0.045725 -0.273937 0.079028 0.099189 0.037919 -0.223936 0.056664 0.078554 0.078918 -0.172105 0.082598 -0.025297 -0.167774 0.089183 0.059808 0.072789 -0.180779 0.071628 0.101906 0.049790 -0.190581 0.155259 0.015455 -0.192441 0.082503 0.082498 0.110118 -0.160826 0.059361 0.088927 0.116230 0.300379 0.649873
charge: -0.212241 -0.151293 -0.182521 -0.031446 -0.143061 -0.205554 0.023630 0.035831 0.029663 0.053807 -0.045088 0.026310 0.040775 0.028313 0.400479 0.126180 0.139978 0.094085 0.313172 -0.112051 0.025435 0.042007 0.033031 -0.075386 0.028160 0.018922 0.008223 0.015468 0.001529 0.027978 0.006565 0.013408 0.013825 -0.037508 0.013791 -0.077821 0.035098 0.020407 0.014250 0.017215 0.031756 0.009349 0.023054 0.014261 -0.016890 0.032355 -0.053012 0.045779 0.021412 0.022744 0.031849 0.048338 0.012844 0.027678 0.032471 -0.150444 0.492896
qa: 0.4059 -0.3757 0.1741 0.3132 -0.0163 0.8495 -0.1633 0.1363 0.1117 0.1207 0.3657 -0.1376 0.1219 0.1266 -0.3624 -0.4873 -0.5317 -0.5225 -0.5274 0.2662 -0.3102 0.1171 0.1318 0.1168 0.0457 -0.2739 0.0790 0.0992 0.0379 -0.2239 0.0567 0.0786 0.0789 -0.1721 0.0826 -0.0253 -0.1678 0.0892 0.0598 0.0728 -0.1808 0.0716 0.1019 0.0498 -0.1906 0.1553 0.0155 -0.1924 0.0825 0.0825 0.1101 -0.1608 0.0594 0.0889 0.1162 0.3004 0.6499
va: 3.8094 3.2094 4.0395 3.4618 4.0635 3.1045 3.9397 1.0075 1.0120 1.0282 3.8189 3.8033 1.0171 1.0264 2.1821 2.0005 1.8506 1.9036 1.8409 1.0208 4.0871 1.0193 0.9952 3.8295 1.0173 3.9758 1.0066 1.0109 1.0000 3.9766 1.0103 1.0048 1.0100 3.6927 1.0140 3.6970 3.9504 1.0031 1.0041 1.0085 3.9379 1.0060 1.0048 1.0082 3.6274 1.0246 3.6562 3.9508 1.0017 1.0046 1.0009 3.9682 1.0059 1.0092 1.0011 1.0366 0.6533
e0: -1333.391476047 hartree
corrType: DLPNO BASED
energy: -1339.016285218078
dipole: 215.64674 -217.38481 -1.73807 -80.29123 82.22271 1.93148 4.72501 -4.91699 -0.19198
magnitude: 2.60545 au
magnitude: 6.62253 debye
