program: Orca
programVersion: 5.0.1
elementType: C C C C C C C H H H C C H H O O O O O H C H H C H C H H H C H H H C H C C H H H C H H H C H C C H H H C H H H H Ag
elementType: Ag
charge: 1
multiplicity: 1
keywords: DLPNO-CCSD(T) def2-TZVPP def2-TZVPP/C VeryTightSCF
formula: C21H30O5Ag
InChI: InChI=1S/C21H30O5.Ag/c1-12(2)7-8-15-18(23)17(16(22)11-14(5)6)20(25)21(26,19(15)24)10-9-13(3)4;/h7,9,14-15,22,26H,8,10-11H2,1-6H3;/q-1;+1
57 atoms
C  0.028895 0.495557 -0.420278
C  1.325295 0.530946 0.212361
C  1.598311 -0.461939 1.24369
C  0.805504 -1.754011 1.244879
C  -0.610225 -1.615813 0.778276
C  -1.078727 -0.240462 0.370648
C  1.512571 -2.77209 0.280317
H  0.896662 -3.671847 0.291138
H  1.475842 -2.371413 -0.734037
H  0.816728 -2.1736 2.252541
C  2.315024 1.475965 -0.085609
C  2.279817 2.469394 -1.192827
H  3.12243 2.215689 -1.844002
H  1.36881 2.357729 -1.7727
O  3.390875 1.529156 0.633115
O  2.539069 -0.361015 2.023555
O  -1.352439 -2.581764 0.728019
O  -0.334946 1.008283 -1.461969
O  -2.204505 -0.308835 -0.466055
H  -1.972678 0.269987 -1.222865
C  -1.439311 0.530486 1.67663
H  -2.286383 0.004751 2.119442
H  -0.613609 0.446341 2.386434
C  2.438609 3.921239 -0.703334
H  3.379602 3.991551 -0.153479
C  2.508229 4.853562 -1.907014
H  3.337802 4.595403 -2.56647
H  2.646867 5.885968 -1.585804
H  1.586443 4.807875 -2.491677
C  1.297554 4.308792 0.232211
H  1.393306 5.346719 0.550612
H  1.285098 3.693597 1.135352
H  0.332771 4.200725 -0.271068
C  2.90973 -3.10359 0.692905
H  2.989501 -3.744873 1.565391
C  4.036369 -2.692148 0.114744
C  5.369955 -3.127269 0.646948
H  5.964143 -2.26007 0.944343
H  5.269561 -3.785447 1.507798
H  5.939538 -3.651489 -0.123675
C  4.110271 -1.773805 -1.070543
H  3.139278 -1.46909 -1.456843
H  4.661754 -2.24774 -1.884957
H  4.665929 -0.870836 -0.804289
C  -1.740953 1.973532 1.419404
H  -0.872011 2.617439 1.330332
C  -2.943661 2.530493 1.2884
C  -3.075042 4.004272 1.037763
H  -2.105203 4.494775 0.976012
H  -3.649669 4.47869 1.836178
H  -3.616261 4.189285 0.107163
C  -4.24703 1.793544 1.380427
H  -4.792005 1.881972 0.437725
H  -4.879605 2.240466 2.149768
H  -4.135414 0.735342 1.607179
H  3.319025 0.849164 1.363797
Ag -3.339456 -2.317089 -0.398714
totalener: -1333.39301281 hartree
nucrepener: 2954.97299303 hartree
electener: -4288.36600584 hartree
oneelecener: -7739.56217042 hartree
twoeener: 3451.19616458 hartree
kineticenergy: 1243.31127014 hartree
chargesum: 1.0000000
charge: 0.200186 -0.292465 0.219717 0.312144 0.089478 0.789512 -0.133643 0.122298 0.096004 0.138411 0.399252 -0.203282 0.109598 0.119262 -0.371021 -0.466847 -0.558307 -0.517899 -0.600309 0.300149 -0.170516 0.105421 0.136222 0.165249 0.051333 -0.228697 0.072686 0.078003 0.060179 -0.283271 0.096187 0.065214 0.054775 -0.176938 0.063468 0.016429 -0.164669 0.069448 0.072874 0.074883 -0.211461 0.047615 0.102319 0.072609 -0.110751 0.057081 -0.031810 -0.168417 0.064045 0.083234 0.073011 -0.176684 0.074228 0.097265 0.024410 0.296393 0.796398
charge: -0.205958 -0.149734 -0.190826 -0.025052 -0.130005 -0.197029 0.015012 0.031937 0.022067 0.057885 -0.050507 0.023579 0.043524 0.028908 0.400311 0.141177 0.125116 0.096747 0.315374 -0.111702 0.013470 0.030354 0.035797 -0.081637 0.023972 0.030712 0.011282 0.014532 0.011595 0.021098 0.016149 0.003903 0.009866 -0.033594 0.015401 -0.074790 0.037451 0.017291 0.017032 0.018129 0.028336 0.002101 0.021949 0.018068 -0.036444 0.013604 -0.068945 0.038725 0.016128 0.020443 0.017860 0.033626 0.019223 0.023784 0.001938 -0.142551 0.613315
qa: 0.2002 -0.2925 0.2197 0.3121 0.0895 0.7895 -0.1336 0.1223 0.0960 0.1384 0.3993 -0.2033 0.1096 0.1193 -0.3710 -0.4668 -0.5583 -0.5179 -0.6003 0.3001 -0.1705 0.1054 0.1362 0.1652 0.0513 -0.2287 0.0727 0.0780 0.0602 -0.2833 0.0962 0.0652 0.0548 -0.1769 0.0635 0.0164 -0.1647 0.0694 0.0729 0.0749 -0.2115 0.0476 0.1023 0.0726 -0.1108 0.0571 -0.0318 -0.1684 0.0640 0.0832 0.0730 -0.1767 0.0742 0.0973 0.0244 0.2964 0.7964
va: 3.9473 3.2443 4.0248 3.4621 3.9191 3.1569 3.9077 1.0177 1.0031 1.0272 3.7207 3.8575 1.0181 1.0305 2.1759 1.9981 1.8545 1.9359 1.7618 0.9947 3.8620 1.0151 0.9973 3.7216 1.0337 3.9717 1.0061 1.0077 1.0044 3.9991 1.0097 0.9997 1.0054 3.7782 1.0257 3.7590 3.9675 1.0026 1.0082 1.0016 3.9685 0.9983 1.0039 1.0059 3.6628 1.0210 3.7803 3.9587 1.0066 1.0036 1.0021 3.9503 1.0040 1.0062 1.0096 1.0347 0.3324
e0: -1333.393012833 hartree
corrType: DLPNO BASED
energy: -1339.001115070963
dipole: 239.88483 -242.23369 -2.34886 176.39874 -177.37969 -0.98095 37.45467 -38.04295 -0.58828
magnitude: 2.61256 au
magnitude: 6.64061 debye
