program: Orca
programVersion: 5.0.1
elementType: C C C C C C C H H H C C H H O O O O O H C H H C H C H H H C H H H C H C C H H H C H H H C H C C H H H C H H H H Ag
elementType: Ag
charge: 1
multiplicity: 1
keywords: DLPNO-CCSD(T) def2-TZVPP def2-TZVPP/C VeryTightSCF
formula: C21H30O5Ag
InChI: InChI=1S/C21H30O5.Ag/c1-12(2)7-8-15-18(23)17(16(22)11-14(5)6)20(25)21(26,19(15)24)10-9-13(3)4;/h7,9,14-15,22,26H,8,10-11H2,1-6H3;/q-1;+1
57 atoms
C  -0.153715 0.009987 0.222696
C  0.648752 0.748082 1.158668
C  1.599724 0.052589 2.013061
C  2.083124 -1.344984 1.67697
C  1.285919 -2.011874 0.594241
C  -0.136823 -1.525266 0.345408
C  3.587736 -1.288091 1.311677
H  4.126122 -0.993595 2.212372
H  3.904314 -2.295408 1.05337
H  1.964752 -1.949319 2.583602
C  0.526906 2.149355 1.316545
C  -0.209551 3.063415 0.407513
H  -1.193759 2.651102 0.19342
H  -0.320177 4.016651 0.925515
O  1.134968 2.739449 2.284914
O  2.123058 0.606303 2.97981
O  1.69961 -2.911092 -0.090388
O  -0.929819 0.508564 -0.592359
O  -0.593689 -2.112309 -0.838578
H  0.099912 -2.724497 -1.133656
C  -1.070594 -1.949726 1.520671
H  -0.801637 -2.972096 1.792092
H  -0.877126 -1.326092 2.393297
C  0.543446 3.280517 -0.926303
H  0.666677 2.303971 -1.40044
C  -0.310398 4.151321 -1.840296
H  0.185369 4.303102 -2.799118
H  -0.482247 5.134644 -1.39711
H  -1.281678 3.693114 -2.033162
C  1.922809 3.890488 -0.700576
H  2.56459 3.249272 -0.093167
H  1.849844 4.857133 -0.198035
H  2.427436 4.047434 -1.653941
C  3.858884 -0.306254 0.20824
H  3.758208 0.739471 0.490679
C  4.222991 -0.56228 -1.047947
C  4.458758 0.564269 -2.013425
H  3.807319 0.467519 -2.885403
H  4.282908 1.537354 -1.556709
H  5.485178 0.541909 -2.385964
C  4.457617 -1.93038 -1.616158
H  3.822947 -2.08831 -2.491201
H  4.261608 -2.735604 -0.914097
H  5.49041 -2.016428 -1.960744
C  -2.543868 -1.954437 1.171433
H  -2.918814 -2.901513 0.793018
C  -3.460275 -1.009609 1.485093
C  -3.125664 0.29022 2.157309
H  -2.057857 0.484088 2.224868
H  -3.537122 0.286332 3.169219
H  -3.593103 1.126898 1.636285
C  -4.933009 -1.282422 1.33242
H  -5.447798 -0.462962 0.828809
H  -5.381763 -1.363087 2.325196
H  -5.131921 -2.211255 0.799594
H  1.639371 2.038331 2.813557
Ag -2.70557 -0.917035 -1.089799
totalener: -1333.39726265 hartree
nucrepener: 3048.70829312 hartree
electener: -4382.10555578 hartree
oneelecener: -7926.06914447 hartree
twoeener: 3543.96358870 hartree
kineticenergy: 1243.27304592 hartree
chargesum: 1.0000000
charge: 0.278476 -0.253722 0.142711 0.222036 0.059717 0.856075 -0.072460 0.123150 0.105794 0.117368 0.348868 -0.085802 0.083845 0.130113 -0.351558 -0.477418 -0.439888 -0.630268 -0.501009 0.258468 -0.328056 0.136151 0.129484 0.094870 0.031871 -0.226844 0.080242 0.070726 0.059007 -0.222431 0.047816 0.081058 0.081124 -0.222155 0.076756 -0.007721 -0.167483 0.063621 0.057985 0.086861 -0.176754 0.061051 0.074539 0.090669 -0.187369 0.150936 0.005440 -0.150950 0.046878 0.120661 0.084578 -0.193301 0.080516 0.110591 0.083571 0.304964 0.656604
charge: -0.187198 -0.149548 -0.173631 -0.036302 -0.172650 -0.203505 0.018148 0.033410 0.028489 0.056994 -0.044058 0.020557 0.027769 0.039319 0.403570 0.145850 0.143187 0.089109 0.320053 -0.109662 0.023532 0.040934 0.032151 -0.080906 0.020103 0.031767 0.014982 0.014463 0.007492 0.028178 0.003411 0.016700 0.014823 -0.045467 0.009731 -0.077558 0.032235 0.013619 0.012562 0.019996 0.032613 0.016672 0.009602 0.020995 -0.012868 0.031659 -0.055618 0.047837 0.013286 0.032440 0.025548 0.045477 0.020911 0.031627 0.022990 -0.154024 0.488206
qa: 0.2785 -0.2537 0.1427 0.2220 0.0597 0.8561 -0.0725 0.1231 0.1058 0.1174 0.3489 -0.0858 0.0838 0.1301 -0.3516 -0.4774 -0.4399 -0.6303 -0.5010 0.2585 -0.3281 0.1362 0.1295 0.0949 0.0319 -0.2268 0.0802 0.0707 0.0590 -0.2224 0.0478 0.0811 0.0811 -0.2222 0.0768 -0.0077 -0.1675 0.0636 0.0580 0.0869 -0.1768 0.0611 0.0745 0.0907 -0.1874 0.1509 0.0054 -0.1509 0.0469 0.1207 0.0846 -0.1933 0.0805 0.1106 0.0836 0.3050 0.6566
va: 3.7574 3.2204 3.9794 3.6743 4.0469 3.1383 3.8872 1.0164 1.0130 1.0240 3.8314 3.8100 1.0290 1.0165 2.1971 2.0033 1.9962 1.7256 1.8748 1.0243 4.0320 1.0146 0.9957 3.7713 1.0360 3.9712 1.0076 1.0073 1.0048 3.9683 1.0089 1.0150 1.0040 3.7339 1.0118 3.6787 3.9573 1.0013 1.0029 1.0053 3.9473 1.0060 1.0087 1.0032 3.6324 1.0223 3.6413 3.9674 1.0010 1.0038 1.0092 3.9493 1.0008 1.0009 1.0043 1.0368 0.6332
e0: -1333.397262592 hartree
corrType: DLPNO BASED
energy: -1339.018635112760
dipole: 189.82285 -192.47135 -2.64850 69.66152 -70.24775 -0.58622 79.12345 -79.18688 -0.06344
magnitude: 2.71335 au
magnitude: 6.89678 debye
