program: Orca
programVersion: 5.0.2
elementType: C C C C C C C H H H C C H H O O O O O H C H H C H C H H H C H H H C H C C H H H C H H H C H C C H H H C H H H H Ag
elementType: Ag
charge: 1
multiplicity: 1
keywords: wB97X-D3 TightOpt Freq def2-TZVPP TightSCF defgrid3 CHELPG
frequency: 0.00 0.00 0.00 0.00 0.00 0.00 15.62 28.82 40.69 53.59 60.57 72.14 73.45 92.50 94.33 101.68 113.55 116.56 124.38 125.32 139.99 147.45 156.48 158.54 186.43 193.73 208.07 215.61 225.42 228.12 233.27 240.14 248.73 259.58 266.81 288.92 310.31 322.44 332.86 357.95 375.45 377.88 381.32 398.73 405.14 407.61 421.54 445.73 460.00 474.95 488.54 493.37 516.32 547.35 576.26 604.77 622.26 648.44 683.11 716.03 734.97 762.97 792.05 815.43 829.01 857.06 862.23 866.72 896.12 898.21 922.88 944.06 945.62 967.86 970.28 972.36 978.09 985.08 999.10 1026.53 1033.65 1034.33 1035.71 1048.58 1056.88 1087.54 1101.55 1103.90 1127.05 1131.22 1135.60 1145.80 1168.79 1202.59 1206.69 1215.42 1220.07 1229.32 1257.76 1262.52 1271.87 1293.39 1313.28 1329.77 1347.63 1362.87 1372.99 1383.56 1389.76 1392.71 1402.41 1409.74 1414.09 1419.78 1427.85 1428.25 1428.85 1435.10 1436.84 1438.03 1471.46 1472.14 1477.63 1484.46 1485.69 1487.37 1487.49 1493.51 1494.55 1497.09 1502.57 1506.21 1509.24 1512.37 1517.00 1603.83 1660.08 1667.82 1701.58 1786.70 1831.73 3052.27 3053.87 3056.70 3058.70 3059.16 3062.74 3066.38 3067.93 3084.56 3088.32 3106.44 3110.39 3124.32 3125.08 3125.97 3127.22 3129.45 3130.63 3132.27 3134.40 3140.74 3143.46 3152.06 3153.58 3153.94 3161.52 3171.12 3182.61 3205.91 3864.70
frequency: 15.62 28.82 40.69 53.59 60.57 72.14 73.45 92.50 94.33 101.68 113.55 116.56 124.38 125.32 139.99 147.45 156.48 158.54 186.43 193.73 208.07 215.61 225.42 228.12 233.27 240.14 248.73 259.58 266.81 288.92 310.31 322.44 332.86 357.95 375.45 377.88 381.32 398.73 405.14 407.61 421.54 445.73 460.00 474.95 488.54 493.37 516.32 547.35 576.26 604.77 622.26 648.44 683.11 716.03 734.97 762.97 792.05 815.43 829.01 857.06 862.23 866.72 896.12 898.21 922.88 944.06 945.62 967.86 970.28 972.36 978.09 985.08 999.10 1026.53 1033.65 1034.33 1035.71 1048.58 1056.88 1087.54 1101.55 1103.90 1127.05 1131.22 1135.60 1145.80 1168.79 1202.59 1206.69 1215.42 1220.07 1229.32 1257.76 1262.52 1271.87 1293.39 1313.28 1329.77 1347.63 1362.87 1372.99 1383.56 1389.76 1392.71 1402.41 1409.74 1414.09 1419.78 1427.85 1428.25 1428.85 1435.10 1436.84 1438.03 1471.46 1472.14 1477.63 1484.46 1485.69 1487.37 1487.49 1493.51 1494.55 1497.09 1502.57 1506.21 1509.24 1512.37 1517.00 1603.83 1660.08 1667.82 1701.58 1786.70 1831.73 3052.27 3053.87 3056.70 3058.70 3059.16 3062.74 3066.38 3067.93 3084.56 3088.32 3106.44 3110.39 3124.32 3125.08 3125.97 3127.22 3129.45 3130.63 3132.27 3134.40 3140.74 3143.46 3152.06 3153.58 3153.94 3161.52 3171.12 3182.61 3205.91 3864.70
formula: C21H30O5Ag
InChI: InChI=1S/C21H30O5.Ag/c1-12(2)7-8-15-18(23)17(16(22)11-14(5)6)20(25)21(26,19(15)24)10-9-13(3)4;/h7,9,14-15,22,26H,8,10-11H2,1-6H3;
57 atoms
C  -1.96222 -0.617284 -0.550314
C  -2.551968 0.690528 -0.621669
C  -1.832095 1.876787 -0.130092
C  -0.678911 1.685862 0.87712
C  -0.552183 0.233787 1.243396
C  -0.552177 -0.742697 0.066651
C  0.585965 2.379061 0.307996
H  0.600245 2.220553 -0.766706
H  0.433589 3.451901 0.444457
H  -1.004959 2.200568 1.781796
C  -3.822031 0.807586 -1.226708
C  -4.597408 2.072226 -1.364969
H  -4.375319 2.720429 -0.51732
H  -4.158848 2.595728 -2.22258
O  -4.401099 -0.241595 -1.710113
O  -2.101349 3.009599 -0.453678
O  -0.583433 -0.163103 2.380988
O  -2.472426 -1.640854 -1.011469
O  0.371646 -0.245563 -0.900404
H  0.208099 -0.673654 -1.744266
C  -0.204596 -2.168681 0.483899
H  -0.988586 -2.532825 1.147116
H  -0.239269 -2.79707 -0.405285
C  -6.108063 1.90425 -1.546176
H  -6.286354 1.205059 -2.365604
C  -6.756737 1.348295 -0.280736
H  -6.35328 0.373183 -0.00496
H  -7.831179 1.228735 -0.419743
H  -6.60691 2.029507 0.560757
C  -6.71813 3.250928 -1.924076
H  -7.79505 3.159116 -2.065142
H  -6.292125 3.639825 -2.850239
H  -6.549148 3.992705 -1.139784
C  1.979206 2.048658 0.813017
H  2.73117 2.155556 0.032076
C  2.471769 1.983204 2.08419
C  3.960163 2.049081 2.323158
H  4.194701 3.021959 2.762104
H  4.29082 1.299431 3.042886
H  4.539954 1.948177 1.406498
C  1.636672 2.109178 3.324194
H  2.043723 1.504966 4.134575
H  0.5958 1.83725 3.186949
H  1.679558 3.150799 3.654415
C  1.116992 -2.308659 1.21146
H  1.04428 -2.2723 2.294724
C  2.310743 -2.703086 0.688352
C  3.444573 -3.115508 1.59403
H  3.553403 -4.201487 1.542889
H  3.265418 -2.847642 2.634477
H  4.398745 -2.694883 1.273894
C  2.526852 -3.005965 -0.767677
H  3.472071 -2.592559 -1.12097
H  1.72902 -2.639868 -1.40687
H  2.594952 -4.089179 -0.894397
H  -3.804441 -1.032546 -1.573578
Ag 2.275394 -0.251467 1.042849
totalener: -1341.28339658 hartree
nucrepener: 3105.82654447 hartree
electener: -4447.10994105 hartree
oneelecener: -8040.60827639 hartree
twoeener: 3593.49833534 hartree
kineticenergy: 1245.94500674 hartree
xcener: -125.313247253210 hartree
chargesum: 1.0000000
charge: 0.079068 -0.211274 0.077106 0.209455 0.033481 0.546463 -0.253889 0.122663 0.135759 0.125119 0.249698 -0.151196 0.107143 0.119679 -0.237586 -0.332924 -0.276972 -0.382133 -0.347849 0.200907 -0.321356 0.136905 0.132251 0.077481 0.041382 -0.269039 0.085078 0.098400 0.082852 -0.257946 0.094026 0.088283 0.082387 -0.155696 0.188084 0.072869 -0.197045 0.128806 0.100462 0.092215 -0.225307 0.101382 0.110489 0.134472 -0.092804 0.205463 0.040708 -0.195900 0.127128 0.095290 0.098443 -0.216012 0.101659 0.081878 0.134318 0.232335 0.153335
charge: -0.235044 -0.132626 -0.252982 -0.052235 -0.249958 -0.233376 0.007262 0.037641 0.049761 0.053169 -0.091473 -0.000679 0.044852 0.056323 0.455932 0.161599 0.199813 0.182150 0.355728 -0.111883 0.003977 0.054757 0.039368 -0.102214 0.026059 0.013281 0.009317 0.019995 0.015666 0.016470 0.019153 0.014469 0.017024 -0.031458 0.043707 -0.081496 0.035591 0.039378 0.028680 0.027986 0.045078 0.033819 0.022082 0.040547 -0.011873 0.043555 -0.090499 0.035757 0.038201 0.029532 0.027995 0.036829 0.032455 0.016278 0.039955 -0.162745 0.369351
qa: 0.0791 -0.2113 0.0771 0.2095 0.0335 0.5465 -0.2539 0.1227 0.1358 0.1251 0.2497 -0.1512 0.1071 0.1197 -0.2376 -0.3329 -0.2770 -0.3821 -0.3478 0.2009 -0.3214 0.1369 0.1323 0.0775 0.0414 -0.2690 0.0851 0.0984 0.0829 -0.2579 0.0940 0.0883 0.0824 -0.1557 0.1881 0.0729 -0.1970 0.1288 0.1005 0.0922 -0.2253 0.1014 0.1105 0.1345 -0.0928 0.2055 0.0407 -0.1959 0.1271 0.0953 0.0984 -0.2160 0.1017 0.0819 0.1343 0.2323 0.1533
va: 4.0913 3.4680 4.1623 3.6730 3.9124 3.3946 4.0245 1.0142 1.0099 1.0212 3.9271 3.9083 1.0196 1.0135 2.3304 2.1525 2.1691 2.1346 2.0502 1.0398 4.0987 1.0209 1.0152 3.8140 1.0267 3.9317 1.0116 1.0088 1.0059 3.9426 1.0074 1.0064 1.0036 3.7366 1.0099 3.6390 3.9314 0.9981 1.0028 1.0093 3.9409 1.0088 1.0287 0.9953 3.5482 1.0109 3.7442 3.9155 0.9981 1.0093 1.0034 3.9534 1.0080 1.0191 0.9986 1.1072 1.6248
dispcorr: -0.034481489 hartree
energy: -1341.405916659300
dipole: -179.25075 182.12017 2.86942 40.40296 -41.10312 -0.70016 -44.97010 45.21104 0.24093
magnitude: 2.96341 au
magnitude: 7.53240 debye
temp: 298.15 k
press: 1.00 atm
zeropoint: 0.48134555 hartree
thermalvibcorrection: 0.02761588 hartree
thermalrotcorrection: 0.00141627 hartree
thermaltrasncorrection: 0.00141627 hartree
thermaltotal: -1340.89412268 hartree
thermalcorr: 0.03044843 hartree
nonthermalcorr: 0.48134555 hartree
totalcorr: 0.51179398 hartree
thermalcorrenthalpy: 0.00094421 hartree
totalenthalpy: -1340.89317847 hartree
totalentropycorr: -0.08790038 hartree
gibbsenthalpy: -1340.98107886 hartree
gibbsminuselec: 0.42483780 hartree
