program: Orca
programVersion: 5.0.2
elementType: C C C C C C C H H H C C H H O O O O O H C H H C H C H H H C H H H C H C C H H H C H H H C H C C H H H C H H H H Ag
elementType: Ag
charge: 1
multiplicity: 1
keywords: wB97X-D3 TightOpt Freq def2-TZVPP TightSCF defgrid3 CHELPG
frequency: 0.00 0.00 0.00 0.00 0.00 0.00 21.99 29.65 36.31 41.98 61.05 65.22 79.19 85.82 97.32 101.49 109.47 118.67 126.05 128.91 151.15 163.65 166.65 173.33 181.84 203.18 215.26 222.59 223.75 230.44 234.21 253.68 262.15 273.76 287.65 307.74 316.12 317.77 334.81 345.53 355.90 364.56 389.25 396.09 409.83 416.09 429.63 451.07 457.79 477.99 487.78 499.14 513.07 529.08 541.04 581.41 629.77 640.08 701.37 717.05 751.69 774.50 799.17 811.95 834.05 856.88 864.52 878.13 895.27 915.73 918.76 942.96 949.41 964.35 972.37 977.07 982.89 1001.45 1014.15 1024.26 1030.39 1038.40 1048.46 1053.20 1056.90 1099.20 1101.61 1105.52 1121.87 1126.22 1134.81 1153.33 1171.78 1196.38 1198.50 1208.74 1218.14 1238.50 1262.48 1264.22 1268.92 1291.44 1314.41 1315.56 1343.69 1350.94 1356.26 1369.95 1377.50 1390.30 1396.86 1401.42 1408.28 1419.89 1426.85 1427.55 1435.28 1436.37 1437.87 1462.67 1474.37 1475.45 1475.77 1480.77 1486.20 1488.43 1489.01 1495.65 1498.29 1499.12 1506.67 1508.91 1510.41 1514.50 1516.29 1608.53 1660.64 1666.05 1709.64 1783.60 1828.83 3022.14 3054.23 3056.53 3058.60 3058.73 3064.75 3065.65 3076.68 3085.91 3091.54 3094.31 3095.80 3124.91 3125.44 3127.09 3131.17 3131.78 3132.45 3139.12 3142.93 3144.29 3149.62 3153.30 3154.75 3159.99 3165.93 3170.82 3178.37 3188.09 3872.27
frequency: 21.99 29.65 36.31 41.98 61.05 65.22 79.19 85.82 97.32 101.49 109.47 118.67 126.05 128.91 151.15 163.65 166.65 173.33 181.84 203.18 215.26 222.59 223.75 230.44 234.21 253.68 262.15 273.76 287.65 307.74 316.12 317.77 334.81 345.53 355.90 364.56 389.25 396.09 409.83 416.09 429.63 451.07 457.79 477.99 487.78 499.14 513.07 529.08 541.04 581.41 629.77 640.08 701.37 717.05 751.69 774.50 799.17 811.95 834.05 856.88 864.52 878.13 895.27 915.73 918.76 942.96 949.41 964.35 972.37 977.07 982.89 1001.45 1014.15 1024.26 1030.39 1038.40 1048.46 1053.20 1056.90 1099.20 1101.61 1105.52 1121.87 1126.22 1134.81 1153.33 1171.78 1196.38 1198.50 1208.74 1218.14 1238.50 1262.48 1264.22 1268.92 1291.44 1314.41 1315.56 1343.69 1350.94 1356.26 1369.95 1377.50 1390.30 1396.86 1401.42 1408.28 1419.89 1426.85 1427.55 1435.28 1436.37 1437.87 1462.67 1474.37 1475.45 1475.77 1480.77 1486.20 1488.43 1489.01 1495.65 1498.29 1499.12 1506.67 1508.91 1510.41 1514.50 1516.29 1608.53 1660.64 1666.05 1709.64 1783.60 1828.83 3022.14 3054.23 3056.53 3058.60 3058.73 3064.75 3065.65 3076.68 3085.91 3091.54 3094.31 3095.80 3124.91 3125.44 3127.09 3131.17 3131.78 3132.45 3139.12 3142.93 3144.29 3149.62 3153.30 3154.75 3159.99 3165.93 3170.82 3178.37 3188.09 3872.27
formula: C21H30O5Ag
InChI: InChI=1S/C21H30O5.Ag/c1-12(2)7-8-15-18(23)17(16(22)11-14(5)6)20(25)21(26,19(15)24)10-9-13(3)4;/h7,9,14-15,22,26H,8,10-11H2,1-6H3;
57 atoms
C  -2.249266 -0.798833 0.248811
C  -2.73941 0.460957 -0.307451
C  -1.878414 1.628526 -0.372361
C  -0.58256 1.683218 0.428957
C  -0.354789 0.405909 1.185283
C  -0.699419 -0.86727 0.421483
C  0.619464 2.075515 -0.461446
H  0.603276 1.488864 -1.374981
H  0.472516 3.118172 -0.752579
H  -0.726841 2.463908 1.180027
C  -4.033587 0.56555 -0.854475
C  -5.095154 -0.469367 -0.767768
H  -5.829597 -0.246681 -1.542922
H  -4.663136 -1.451718 -0.948176
O  -4.39441 1.643304 -1.470162
O  -2.184035 2.648925 -0.989899
O  0.006098 0.390106 2.336684
O  -2.900903 -1.786272 0.49711
O  -0.116734 -0.744476 -0.874127
H  -0.542394 -1.361333 -1.473602
C  -0.220997 -2.121026 1.140863
H  -0.510899 -2.057946 2.186654
H  -0.757206 -2.975349 0.722809
C  -5.790719 -0.482405 0.613702
H  -5.019798 -0.653235 1.368691
C  -6.488253 0.840897 0.910502
H  -5.793389 1.682108 0.933145
H  -6.981849 0.798178 1.881567
H  -7.249663 1.061026 0.159125
C  -6.767575 -1.651358 0.661905
H  -7.262173 -1.697865 1.632333
H  -6.256834 -2.601098 0.49869
H  -7.542748 -1.54538 -0.100524
C  1.950125 1.970079 0.237932
H  1.977498 2.356443 1.255403
C  3.150749 1.695319 -0.349115
C  4.440879 1.987227 0.376193
H  5.166148 1.180409 0.263583
H  4.895803 2.875169 -0.069666
H  4.287998 2.187498 1.435868
C  3.299393 1.368575 -1.810749
H  3.53371 2.287962 -2.353451
H  2.401281 0.943344 -2.253074
H  4.130921 0.684283 -1.977793
C  1.2612 -2.377362 0.981861
H  1.558196 -2.754731 0.006179
C  2.199173 -2.452424 1.968617
C  3.547676 -3.069071 1.693214
H  4.361736 -2.474373 2.109468
H  3.726725 -3.23095 0.630864
H  3.591227 -4.040477 2.191593
C  1.910162 -2.175299 3.41647
H  1.748032 -3.128197 3.926918
H  1.036659 -1.547663 3.566735
H  2.766167 -1.704411 3.900251
H  -3.626332 2.288316 -1.45683
Ag 2.37239 -0.312102 0.748989
totalener: -1341.00791031 hartree
nucrepener: 3264.68543768 hartree
electener: -4605.69334798 hartree
oneelecener: -8355.05833113 hartree
twoeener: 3749.36498315 hartree
kineticenergy: 1247.39160531 hartree
xcener: -125.603751033888 hartree
chargesum: 1.0000000
charge: 0.109531 -0.231665 0.083643 0.287931 -0.051662 0.553669 -0.285601 0.128009 0.138609 0.119785 0.245122 -0.125708 0.117426 0.110899 -0.225893 -0.373502 -0.285088 -0.343619 -0.341654 0.190221 -0.305244 0.133864 0.129025 -0.008882 0.066129 -0.242883 0.080850 0.095362 0.089638 -0.264430 0.092448 0.094470 0.086768 -0.126218 0.188204 0.053422 -0.193825 0.096209 0.128656 0.098222 -0.218333 0.135368 0.098085 0.102977 -0.073816 0.171408 0.051726 -0.196856 0.097620 0.093274 0.128848 -0.228991 0.134691 0.114353 0.096257 0.237753 0.143400
charge: -0.267272 -0.135869 -0.217508 -0.045575 -0.243795 -0.233685 0.011565 0.030567 0.049182 0.063527 -0.107009 0.005845 0.042412 0.035248 0.449486 0.189640 0.196423 0.164012 0.338908 -0.112445 0.004807 0.045604 0.045600 -0.096097 0.025763 0.015084 0.009729 0.019527 0.020234 0.018890 0.018973 0.016634 0.018193 -0.007656 0.046469 -0.100031 0.036411 0.028123 0.039159 0.030184 0.039242 0.040153 0.024647 0.031147 -0.019355 0.038127 -0.085772 0.035158 0.027979 0.027780 0.039258 0.039088 0.038686 0.023792 0.031316 -0.163940 0.383437
qa: 0.1095 -0.2317 0.0836 0.2879 -0.0517 0.5537 -0.2856 0.1280 0.1386 0.1198 0.2451 -0.1257 0.1174 0.1109 -0.2259 -0.3735 -0.2851 -0.3436 -0.3417 0.1902 -0.3052 0.1339 0.1290 -0.0089 0.0661 -0.2429 0.0808 0.0954 0.0896 -0.2644 0.0924 0.0945 0.0868 -0.1262 0.1882 0.0534 -0.1938 0.0962 0.1287 0.0982 -0.2183 0.1354 0.0981 0.1030 -0.0738 0.1714 0.0517 -0.1969 0.0976 0.0933 0.1288 -0.2290 0.1347 0.1144 0.0963 0.2378 0.1434
va: 4.1270 3.4530 4.1130 3.6386 4.0315 3.2958 3.9860 1.0117 1.0147 1.0372 3.9322 3.8235 1.0232 1.0265 2.3361 2.1423 2.1331 2.1238 2.0981 1.0437 4.0599 1.0098 1.0229 3.8443 1.0220 3.9226 1.0098 1.0068 1.0081 3.9446 1.0081 1.0053 1.0037 3.6149 1.0185 3.7588 3.9253 1.0048 0.9968 1.0091 3.9344 0.9957 1.0103 1.0069 3.6624 1.0285 3.7043 3.9141 1.0042 1.0101 0.9973 3.9379 0.9948 1.0177 1.0085 1.1012 1.6332
dispcorr: -0.034516414 hartree
energy: -1341.416673391335
dipole: -179.12496 182.10203 2.97708 10.74244 -11.33656 -0.59412 -18.69256 18.37452 -0.31804
magnitude: 3.05240 au
magnitude: 7.75857 debye
temp: 298.15 k
press: 1.00 atm
zeropoint: 0.48169777 hartree
thermalvibcorrection: 0.02743678 hartree
thermalrotcorrection: 0.00141627 hartree
thermaltrasncorrection: 0.00141627 hartree
thermaltotal: -1340.90470630 hartree
thermalcorr: 0.03026932 hartree
nonthermalcorr: 0.48169777 hartree
totalcorr: 0.51196709 hartree
thermalcorrenthalpy: 0.00094421 hartree
totalenthalpy: -1340.90376209 hartree
totalentropycorr: -0.08730829 hartree
gibbsenthalpy: -1340.99107038 hartree
gibbsminuselec: 0.42560301 hartree
