program: Orca
programVersion: 5.0.2
elementType: C C C C C C C H H H C C H H O O O O O H C H H C H C H H H C H H H C H C C H H H C H H H C H C C H H H C H H H H Ag
elementType: Ag
charge: 1
multiplicity: 1
keywords: wB97X-D3 TightOpt Freq def2-TZVPP TightSCF defgrid3 CHELPG
frequency: 0.00 0.00 0.00 0.00 0.00 0.00 22.12 27.65 40.62 41.40 53.75 65.53 81.08 88.12 96.41 101.77 110.11 112.67 124.87 130.39 145.60 155.96 167.25 175.52 182.56 201.68 215.83 218.33 221.91 232.63 236.28 245.96 258.12 267.68 285.33 306.75 318.75 321.62 328.07 355.65 364.76 377.93 390.43 395.90 404.69 410.24 431.61 453.32 458.13 476.67 487.39 496.84 511.64 533.87 546.08 573.85 621.46 638.82 709.86 719.05 750.59 783.83 797.54 810.73 832.42 857.88 865.14 868.91 902.15 914.57 925.91 942.68 952.51 964.82 969.47 976.77 982.58 995.82 1011.86 1027.54 1034.94 1042.63 1050.69 1053.87 1063.83 1095.95 1099.61 1103.99 1122.39 1124.64 1129.38 1152.94 1166.12 1197.84 1199.00 1211.19 1220.12 1236.74 1262.83 1266.41 1271.08 1292.71 1314.14 1316.60 1343.00 1352.82 1360.11 1369.07 1376.82 1384.94 1394.56 1400.82 1406.87 1419.82 1426.70 1427.65 1434.83 1436.79 1437.89 1463.26 1471.71 1475.37 1477.30 1479.30 1487.14 1488.66 1488.93 1494.89 1497.06 1499.16 1505.95 1507.61 1509.95 1510.55 1516.84 1610.14 1661.09 1667.89 1706.67 1782.24 1841.00 2982.58 3054.34 3056.73 3058.50 3058.61 3064.52 3066.87 3076.93 3085.05 3094.98 3097.86 3107.07 3123.67 3124.39 3127.35 3129.82 3130.92 3132.02 3139.45 3143.11 3146.45 3152.34 3154.47 3155.74 3161.99 3163.79 3170.48 3172.02 3180.16 3867.82
frequency: 22.12 27.65 40.62 41.40 53.75 65.53 81.08 88.12 96.41 101.77 110.11 112.67 124.87 130.39 145.60 155.96 167.25 175.52 182.56 201.68 215.83 218.33 221.91 232.63 236.28 245.96 258.12 267.68 285.33 306.75 318.75 321.62 328.07 355.65 364.76 377.93 390.43 395.90 404.69 410.24 431.61 453.32 458.13 476.67 487.39 496.84 511.64 533.87 546.08 573.85 621.46 638.82 709.86 719.05 750.59 783.83 797.54 810.73 832.42 857.88 865.14 868.91 902.15 914.57 925.91 942.68 952.51 964.82 969.47 976.77 982.58 995.82 1011.86 1027.54 1034.94 1042.63 1050.69 1053.87 1063.83 1095.95 1099.61 1103.99 1122.39 1124.64 1129.38 1152.94 1166.12 1197.84 1199.00 1211.19 1220.12 1236.74 1262.83 1266.41 1271.08 1292.71 1314.14 1316.60 1343.00 1352.82 1360.11 1369.07 1376.82 1384.94 1394.56 1400.82 1406.87 1419.82 1426.70 1427.65 1434.83 1436.79 1437.89 1463.26 1471.71 1475.37 1477.30 1479.30 1487.14 1488.66 1488.93 1494.89 1497.06 1499.16 1505.95 1507.61 1509.95 1510.55 1516.84 1610.14 1661.09 1667.89 1706.67 1782.24 1841.00 2982.58 3054.34 3056.73 3058.50 3058.61 3064.52 3066.87 3076.93 3085.05 3094.98 3097.86 3107.07 3123.67 3124.39 3127.35 3129.82 3130.92 3132.02 3139.45 3143.11 3146.45 3152.34 3154.47 3155.74 3161.99 3163.79 3170.48 3172.02 3180.16 3867.82
formula: C21H30O5Ag
InChI: InChI=1S/C21H30O5.Ag/c1-12(2)7-8-15-18(23)17(16(22)11-14(5)6)20(25)21(26,19(15)24)10-9-13(3)4;/h7,9,14-15,22,26H,8,10-11H2,1-6H3;
57 atoms
C  -2.165944 -0.878707 0.043921
C  -2.644279 0.48124 -0.190265
C  -1.770856 1.623995 0.0013
C  -0.427027 1.47763 0.704492
C  -0.212426 0.068681 1.186314
C  -0.622066 -1.019061 0.199658
C  0.715679 2.011554 -0.193292
H  0.562962 1.679649 -1.216158
H  0.62726 3.100363 -0.203151
H  -0.483949 2.100549 1.599861
C  -3.952458 0.724374 -0.660863
C  -5.023961 -0.293423 -0.807774
H  -5.771742 0.119543 -1.486111
H  -4.608423 -1.203588 -1.235032
O  -4.314566 1.922217 -0.97992
O  -2.090446 2.767785 -0.327803
O  0.179003 -0.187455 2.295319
O  -2.829925 -1.889924 0.042518
O  -0.038301 -0.675773 -1.060765
H  -0.499095 -1.144341 -1.760487
C  -0.195667 -2.412733 0.641207
H  -0.721173 -2.653203 1.5650
H  -0.549792 -3.124581 -0.103313
C  -5.691518 -0.642038 0.543655
H  -4.907347 -0.993068 1.218383
C  -6.374146 0.57033 1.167818
H  -5.673864 1.380412 1.37809
H  -6.847034 0.293821 2.110311
H  -7.150116 0.966444 0.509242
C  -6.674853 -1.786096 0.326014
H  -7.150365 -2.066887 1.265975
H  -6.173629 -2.668226 -0.074171
H  -7.464236 -1.496423 -0.371398
C  2.096414 1.659568 0.295546
H  2.243609 1.709448 1.372921
C  3.216172 1.546316 -0.475378
C  4.585809 1.561302 0.156566
H  5.247114 0.811206 -0.279044
H  5.048088 2.531748 -0.040308
H  4.548248 1.421959 1.236033
C  3.20194 1.688829 -1.974061
H  3.965888 1.064288 -2.437019
H  3.444209 2.723317 -2.230742
H  2.238635 1.456292 -2.422737
C  1.287736 -2.568225 0.89973
H  1.594207 -2.374377 1.923727
C  2.210615 -3.141703 0.078975
C  3.567099 -3.536809 0.608561
H  3.602063 -4.625438 0.69618
H  3.76831 -3.117169 1.593246
H  4.372043 -3.25747 -0.0727
C  1.896607 -3.656465 -1.29807
H  2.69799 -3.421909 -1.999429
H  0.962523 -3.272515 -1.69791
H  1.82712 -4.746381 -1.259124
H  -3.537506 2.540248 -0.822183
Ag 2.429878 -0.68347 0.011533
totalener: -1341.05286682 hartree
nucrepener: 3199.86078479 hartree
electener: -4540.91365161 hartree
oneelecener: -8226.24873291 hartree
twoeener: 3685.33508130 hartree
kineticenergy: 1246.97434589 hartree
xcener: -125.518581029712 hartree
chargesum: 1.0000000
charge: 0.088445 -0.224898 0.071966 0.305354 -0.020645 0.510902 -0.284597 0.122534 0.138403 0.123249 0.246565 -0.122787 0.117638 0.110156 -0.225977 -0.372714 -0.264931 -0.345844 -0.366452 0.201223 -0.306485 0.136405 0.130618 -0.011320 0.066881 -0.242029 0.081639 0.095631 0.089151 -0.264568 0.093024 0.094159 0.086788 -0.127134 0.183922 0.040569 -0.187387 0.093887 0.128521 0.098824 -0.216197 0.103621 0.134997 0.098512 -0.082037 0.206598 0.027139 -0.190043 0.127293 0.098050 0.094708 -0.219078 0.101701 0.082352 0.135985 0.238606 0.169102
charge: -0.269122 -0.135780 -0.217235 -0.045738 -0.246263 -0.230453 0.009490 0.030423 0.049332 0.063213 -0.105582 0.005586 0.042424 0.034451 0.449682 0.191996 0.200125 0.163139 0.351133 -0.113283 0.002588 0.055997 0.039794 -0.095840 0.025823 0.015309 0.009928 0.019723 0.020184 0.018954 0.019167 0.016488 0.018190 -0.005889 0.046875 -0.101572 0.036343 0.027749 0.038782 0.030756 0.038906 0.030793 0.040602 0.024148 -0.009730 0.043640 -0.092658 0.035642 0.038386 0.030389 0.027034 0.035909 0.031383 0.016845 0.040176 -0.166597 0.368242
qa: 0.0884 -0.2249 0.0720 0.3054 -0.0206 0.5109 -0.2846 0.1225 0.1384 0.1232 0.2466 -0.1228 0.1176 0.1102 -0.2260 -0.3727 -0.2649 -0.3458 -0.3665 0.2012 -0.3065 0.1364 0.1306 -0.0113 0.0669 -0.2420 0.0816 0.0956 0.0892 -0.2646 0.0930 0.0942 0.0868 -0.1271 0.1839 0.0406 -0.1874 0.0939 0.1285 0.0988 -0.2162 0.1036 0.1350 0.0985 -0.0820 0.2066 0.0271 -0.1900 0.1273 0.0980 0.0947 -0.2191 0.1017 0.0824 0.1360 0.2386 0.1691
va: 4.0985 3.4254 4.1214 3.6068 4.0387 3.3282 3.9937 1.0124 1.0142 1.0368 3.9319 3.8200 1.0230 1.0270 2.3362 2.1457 2.1784 2.1221 2.0462 1.0386 4.1014 1.0226 1.0144 3.8454 1.0218 3.9222 1.0101 1.0068 1.0080 3.9444 1.0081 1.0053 1.0037 3.6208 1.0215 3.7831 3.9272 1.0048 0.9972 1.0095 3.9334 1.0065 0.9958 1.0083 3.5477 1.0115 3.7616 3.9149 0.9980 1.0094 1.0038 3.9552 1.0073 1.0175 0.9974 1.1022 1.5834
dispcorr: -0.034731076 hartree
energy: -1341.415607437503
dipole: -178.53809 181.42203 2.88393 18.80528 -19.45972 -0.65444 -2.79644 1.71094 -1.08550
magnitude: 3.15019 au
magnitude: 8.00714 debye
temp: 298.15 k
press: 1.00 atm
zeropoint: 0.48160309 hartree
thermalvibcorrection: 0.02747095 hartree
thermalrotcorrection: 0.00141627 hartree
thermaltrasncorrection: 0.00141627 hartree
thermaltotal: -1340.90370085 hartree
thermalcorr: 0.03030350 hartree
nonthermalcorr: 0.48160309 hartree
totalcorr: 0.51190658 hartree
thermalcorrenthalpy: 0.00094421 hartree
totalenthalpy: -1340.90275665 hartree
totalentropycorr: -0.08741651 hartree
gibbsenthalpy: -1340.99017315 hartree
gibbsminuselec: 0.42543428 hartree
