program: Gaussian 09
title: 000037373
version: EM64L-G09RevD.01
frameworkgroup: C1[X(C18H20FNO2)]
method: RPBEPBE
basis: SDD
operation: Freq
keyword: #p
keyword: freq=noraman
keyword: PBEPBE/SDD
title: #p freq=noraman PBEPBE/SDD
converged: YES YES NO NO
title: Mulliken charges:
elementType: F O O N C C C C C C C C C C C C C C C C C C H H H H H H H H H H H H H H H H H H H H
charge: -0.201461 -0.304788 -0.300932 -0.298438 -0.293013 0.361495 0.324794 -0.503246 -0.455984 -0.587852 -0.556941 -0.538804 0.367478 0.191700 0.194669 0.164407 -0.375480 -0.380550 -0.245863 -0.204262 -0.531909 -0.531028 0.250647 0.211238 0.234632 0.198208 0.214119 0.257903 0.209330 0.248367 0.274364 0.252944 0.240048 0.250994 0.228224 0.232885 0.227527 0.249397 0.224623 0.255500 0.225654 0.219406
chargesum: 0.00000
title: Mulliken charges with hydrogens summed into heavy atoms:
elementType: F O O N C C C C C C C C C C C C C C C C C C
charge: -0.201461 -0.304788 -0.300932 -0.040535 -0.042366 0.361495 0.324794 -0.057376 -0.043657 -0.130155 -0.282577 -0.285860 0.367478 0.191700 0.194669 0.164407 -0.135432 -0.129556 -0.017639 0.028623 0.169637 0.169532
polarizability: 2.14724867e+02 7.61831121e+00 2.50660326e+02 2.62924511e+01 3.46991367e+00 1.47816920e+02
1716.lowfreq: -5.9798 -1.2339 -0.0004 -0.0004 0.0007 2.6483 15.5739 28.7643 36.9713
frequency: 14.7307 28.7095 36.9295 50.7443 66.8949 91.2188 96.7123 116.4006 136.5025 160.3347 166.0366 181.0897 208.1059 209.4485 259.6520 272.4242 277.2231 285.0351 310.4038 338.8962 381.9688 387.3869 414.0949 445.4389 448.1294 470.4198 479.8137 497.8977 517.2961 541.3951 566.0843 591.6292 605.1463 649.3327 672.9714 709.6727 717.3552 730.8532 745.1142 752.9222 758.9707 766.7559 839.3114 857.4930 881.0695 883.7942 898.8926 910.5267 928.7116 943.7641 947.7661 961.2220 969.8135 979.6837 1004.8783 1031.1053 1061.7164 1079.8077 1090.7219 1112.8501 1114.0912 1140.1273 1151.1416 1154.3667 1159.8768 1169.6398 1173.9269 1176.5570 1191.6687 1207.3253 1210.6339 1223.3400 1239.1474 1269.1175 1277.4045 1285.1979 1295.9047 1310.6922 1322.7841 1369.5606 1376.3390 1385.8611 1397.9075 1422.0564 1437.0645 1442.2653 1443.8536 1451.5425 1456.6798 1458.0736 1460.6966 1476.7339 1479.1323 1481.9691 1486.3928 1491.7245 1571.1072 1585.9875 1618.4860 1619.1142 2883.9599 2963.9015 2968.5303 2975.7772 2978.1973 2981.0320 3032.4754 3042.5984 3058.7420 3065.3517 3074.6909 3114.2374 3117.7280 3121.0055 3137.4022 3142.1191 3150.7890 3159.2847 3175.5049 3457.9139
redmass: 4.9587 6.4968 3.9006 4.1613 4.1380 2.8987 3.3471 3.7149 3.4531 1.1532 1.1067 4.3405 2.8142 3.6828 4.8630 3.2982 3.8874 5.3198 4.0634 3.2750 3.9537 3.7278 4.7771 3.9651 3.1041 2.8510 3.5333 3.9595 5.8416 4.0183 4.3703 2.7112 4.1414 4.4680 3.5406 4.0621 4.7334 3.1802 3.8493 2.8513 2.1129 1.8151 3.9032 1.5214 1.8154 2.9018 1.9406 1.7404 2.2248 1.8707 2.9200 3.9576 2.6182 1.3344 3.1699 2.0645 1.9425 2.4368 3.0514 1.2430 1.2462 1.9661 1.3883 1.5907 1.2207 1.8257 1.5212 1.9142 2.2114 1.2600 1.1637 2.3367 1.3685 3.0163 1.5484 1.3194 1.6868 1.2085 1.5145 5.9120 1.6512 6.1829 2.4714 1.1716 2.2731 1.2972 1.2012 1.3060 1.0557 1.0731 1.1510 1.0849 2.2092 1.1633 1.0648 3.0375 8.3145 6.3338 7.4021 7.2890 1.0711 1.0308 1.0315 1.0606 1.0680 1.0825 1.0981 1.0915 1.1042 1.1031 1.0959 1.1022 1.1028 1.0883 1.0913 1.0888 1.0916 1.0943 1.0997 1.0749
irintensity: 0.0703 1.0193 0.5142 1.3768 3.7031 7.2491 0.8831 1.1396 3.2589 0.3306 0.0987 1.9986 7.4798 1.2691 4.2208 2.9595 2.2110 6.8598 1.4209 0.1574 0.7989 1.2435 2.9936 7.3776 14.9452 44.2832 11.5372 19.7814 4.0680 1.7372 13.1273 42.9680 45.8593 26.2158 17.1726 1.0394 5.4146 11.3587 12.9101 10.2078 57.3589 46.8089 4.1393 5.7558 0.2366 7.0830 2.8647 73.5910 10.8596 25.1497 13.9409 55.3351 7.5753 0.5995 18.4358 6.2873 0.8810 24.7664 66.4357 11.8178 1.4452 17.1965 2.8840 5.7293 7.3239 13.8338 10.3900 15.6364 44.8560 9.7750 0.5714 7.9179 0.1445 96.1853 2.0793 11.9557 30.2296 6.4992 29.8741 3.3959 14.0655 5.0682 7.6965 0.2226 13.7172 17.8957 3.7488 9.1137 11.5231 4.0060 4.4736 0.6726 55.5710 5.9375 7.1521 147.1639 0.8685 8.4781 0.7474 3.4853 88.3277 70.0484 77.1283 31.6445 39.9696 22.5689 32.5181 58.4955 32.2099 25.5391 10.1068 26.7195 26.3672 7.2820 9.2526 7.0605 3.1236 19.6186 11.1888 2.8233
temp: 298.150 k
press: 1.00000 atm
elementType: 9 8 8 7 6 6 6 6 6 6 6 6 6 6 6 6 6 6 6 6 6 6 1 1 1 1 1 1 1 1 1 1 1 1 1 1 1 1 1 1 1 1
symmnumber: 1
zpe: 891983.5 jmol-1
zpe.correction: 0.339739 hartree
zpe.thermalcorrener: 0.360508 hartree
zpe.thermalcorrenthalpy: 0.361452 hartree
zpe.thermalcorrgfe: 0.288562 hartree
zpe.sumelectzpe: -1001.299498 hartree
zpe.sumelectthermal: -1001.278729 hartree
zpe.sumelectthermalent: -1001.277785 hartree
zpe.sumelectthermalfe: -1001.350675 hartree
dipole: -1.6504 0.1537 -0.8338
dipole: 1.8554
quadrupole: -119.1880 -109.8463 -134.0002
quadrupole: -1.7688 4.1929 0.1381
quadrupole: 1.8235 11.1652 -12.9887 -1.7688 4.1929 0.1381
hfenergy: -1001.639237 hartree
pointgroup: C01 [X(C18H20F1N1O2)]
dipole: 0.630893 0.1594853 0.3307604 debye
polarizability: 216.490349|-10.7577967|247.8657063|28.0618995|-4.6327044|148.8460567 unknown
InChI: InChI=1S/C18H20FNO2/c1-21-17-10-12-7-8-20-16(14(12)11-18(17)22-2)9-13-5-3-4-6-15(13)19/h3-6,10-11,16,20H,7-9H2,1-2H3
charge 0 multiplicity 1
42 atoms
F  1.649209 -0.25452 -2.184038
O  -1.376167 -2.492778 0.919202
O  -3.752347 -1.567016 -0.520027
N  0.105151 3.486383 0.656562
C  0.567816 2.084556 0.733504
C  -0.588073 1.132724 0.416632
C  -1.753864 1.584744 -0.263666
C  -1.945037 3.05486 -0.617171
C  -0.616692 3.83188 -0.587453
C  1.832672 1.843856 -0.200792
C  -0.4993 -0.227782 0.799597
C  -2.788197 0.660266 -0.547431
C  2.511336 0.499815 -0.043362
C  -1.523443 -1.145019 0.500155
C  -2.694074 -0.692979 -0.171456
C  2.401332 -0.518309 -1.015299
C  3.292561 0.186752 1.101223
C  3.001889 -1.782743 -0.901686
C  3.909182 -1.074413 1.257091
C  3.763273 -2.063286 0.255161
C  -1.213784 -3.44765 -0.200794
C  -4.440477 -2.194625 0.63165
H  0.895887 1.898453 1.775606
H  -2.422137 3.152985 -1.611278
H  -2.633087 3.509446 0.122997
H  -0.034308 3.60418 -1.512878
H  -0.813775 4.919028 -0.585146
H  0.850692 4.154598 0.887196
H  2.558157 2.642531 0.054853
H  1.523988 1.990986 -1.249646
H  0.374543 -0.604672 1.340695
H  -3.700966 0.986582 -1.059161
H  3.418559 0.952737 1.876438
H  2.876079 -2.517424 -1.702758
H  4.504297 -1.284835 2.151939
H  4.239997 -3.042507 0.368082
H  -0.284233 -3.223821 -0.758882
H  -2.08118 -3.403405 -0.885112
H  -1.141704 -4.442124 0.266331
H  -3.726412 -2.755553 1.26094
H  -5.187708 -2.87322 0.192089
H  -4.947054 -1.420083 1.239096
