program: Gaussian 09
title: 000035350
version: EM64L-G09RevD.01
frameworkgroup: C1[X(C15H25N3O)]
method: RPBEPBE
basis: SDD
operation: Freq
keyword: #p
keyword: freq=noraman
keyword: PBEPBE/SDD
title: #p freq=noraman PBEPBE/SDD
converged: NO YES NO NO
title: Mulliken charges:
elementType: O N N N C C C C C C C C C C C C C C C H H H H H H H H H H H H H H H H H H H H H H H H H
charge: -0.278252 -0.089634 -0.338576 -0.707651 -0.357157 -0.401509 -0.324693 -0.322799 -0.030931 0.095912 -0.707342 -0.677427 0.380454 0.396019 -0.644970 -0.685514 0.571545 -0.834953 -0.828185 0.196046 0.243871 0.265375 0.220726 0.201182 0.179164 0.202353 0.177666 0.302715 0.201270 0.269153 0.211664 0.211484 0.225019 0.205572 0.221656 0.224947 0.221045 0.252747 0.229857 0.272303 0.221946 0.214741 0.307350 0.305816
chargesum: 0.00000
title: Mulliken charges with hydrogens summed into heavy atoms:
elementType: O N N N C C C C C C C C C C C C C C C
charge: -0.278252 -0.089634 -0.035861 -0.094485 0.082759 0.084592 0.055653 0.057220 -0.030931 0.095912 -0.025255 -0.035353 0.380454 0.396019 -0.423314 -0.460568 0.571545 -0.131304 -0.119195
polarizability: 2.74891894e+02 6.24789306e-01 1.81930558e+02 1.10297318e+01 -5.00375104e+00 1.36293403e+02
1716.lowfreq: -11.7500 -3.6477 -0.0007 -0.0007 0.0004 3.2779 20.9224 25.7946 30.9584
frequency: 20.2805 25.4845 30.9327 43.2606 64.2115 75.6523 83.7921 118.3460 125.6822 135.1983 141.9382 158.7038 182.3476 217.9854 226.5089 240.4028 255.2488 263.0283 290.2502 295.3681 297.2767 320.5865 331.3109 372.6951 378.7745 382.9489 387.3630 440.2420 461.2213 500.2401 517.9965 526.7747 532.0096 548.0734 563.0953 606.1291 620.6717 709.5614 732.5812 756.1747 767.0203 798.6841 804.2523 822.0252 850.5736 867.5020 917.9026 944.5636 961.3376 982.2302 989.3306 1035.8562 1037.1834 1039.1877 1045.7653 1048.3738 1057.9812 1069.2310 1074.4649 1083.2932 1092.4172 1125.2404 1127.8115 1174.2121 1196.2489 1210.4166 1246.1757 1250.9582 1269.9576 1282.9768 1288.9601 1309.8593 1323.2706 1352.2041 1360.2994 1364.5450 1374.3298 1380.7186 1387.5493 1396.5889 1400.3736 1401.5904 1434.2484 1446.7910 1448.1138 1460.4502 1463.8035 1465.6874 1471.2286 1472.7106 1476.4970 1480.0988 1482.6877 1484.5739 1492.5288 1500.2494 1505.3447 1564.3711 1585.9805 1631.3906 1643.5785 2833.9725 2843.1813 2951.7618 2970.9125 2977.3172 2983.7611 2984.5280 3007.0508 3019.0168 3024.8142 3031.3619 3053.8492 3067.1835 3073.5408 3077.7282 3083.3919 3091.1320 3091.7971 3094.9835 3095.9205 3110.2893 3116.2497 3557.4356 3566.1277 3707.0629
redmass: 3.2846 4.1450 4.1817 3.4109 3.6484 3.0193 2.5073 2.1763 1.1589 1.5922 1.5721 2.2710 2.7817 2.8823 2.8135 2.7862 1.4255 2.1889 2.6261 1.6661 2.3942 3.1908 3.1069 1.3141 3.2405 1.0620 2.7521 3.7213 2.6888 3.3353 3.7499 2.8490 2.2475 1.5600 4.3656 4.8153 3.0324 3.4624 1.5453 2.5267 3.8842 1.1957 1.3045 2.0991 1.3279 1.8749 1.9213 2.8044 2.4055 3.8825 2.4628 2.5353 1.9555 1.6717 1.8114 1.6287 1.3874 2.0596 2.3496 2.6947 1.6884 1.7455 4.3516 1.7501 1.7496 2.4282 1.5756 1.4581 1.9091 1.1987 1.1892 1.2717 1.2259 1.3110 4.4710 1.3469 6.2107 1.3244 1.2399 1.2205 1.2272 1.2367 1.3037 1.5701 1.6689 1.1494 1.0763 1.0551 1.2798 1.0716 1.0801 1.2668 1.4120 1.0594 1.0650 1.8722 1.0618 6.3356 6.9563 3.4568 1.3532 1.0719 1.0708 1.0584 1.0426 1.0356 1.0375 1.0357 1.0980 1.0861 1.0670 1.0868 1.0912 1.0959 1.0988 1.0983 1.1010 1.1004 1.1001 1.0992 1.1046 1.0909 1.0914 1.0781 1.0448 1.1040
irintensity: 0.1039 0.6863 0.5170 1.9729 0.9685 5.9522 3.3833 0.5121 0.1610 2.2780 0.0243 2.7351 10.1511 0.4802 2.8398 0.8805 1.1348 0.7146 6.4799 0.2776 4.6630 13.5871 1.8054 262.8923 31.1700 0.8535 7.1438 3.2799 2.9298 3.4030 10.6182 3.9256 57.3260 48.3432 0.4462 3.8208 2.4683 12.3819 3.3170 2.7146 5.0915 6.0800 1.9022 15.7016 1.6411 52.2851 0.4873 0.9961 0.1304 2.2667 2.3202 6.5382 2.0982 3.8195 4.1597 11.3507 3.3817 26.5393 8.1743 14.4083 34.3168 20.0562 4.9344 19.8902 108.8184 41.1206 24.8306 2.0191 95.0507 17.5259 7.3333 4.4793 13.7523 3.8305 93.7430 5.0212 19.9755 3.0445 27.6328 13.8452 23.9696 6.0212 67.6402 1.6348 10.8288 28.0598 12.1429 7.4375 89.4661 12.8683 5.9205 130.2824 57.6992 8.6951 11.6262 25.6174 16.7977 86.6143 122.0678 138.1474 333.7810 36.5469 206.8013 38.2126 34.0962 31.3497 25.7070 36.9629 6.4680 31.8094 40.9412 48.5630 25.8847 23.3087 38.1503 54.4047 27.9105 43.8006 14.5963 15.6991 11.8764 28.6243 30.2329 14.8214 82.8883 19.5159
temp: 298.150 k
press: 1.00000 atm
elementType: 8 7 7 7 6 6 6 6 6 6 6 6 6 6 6 6 6 6 6 1 1 1 1 1 1 1 1 1 1 1 1 1 1 1 1 1 1 1 1 1 1 1 1 1
symmnumber: 1
zpe: 995403.8 jmol-1
zpe.correction: 0.379129 hartree
zpe.thermalcorrener: 0.401285 hartree
zpe.thermalcorrenthalpy: 0.402229 hartree
zpe.thermalcorrgfe: 0.326480 hartree
zpe.sumelectzpe: -824.604515 hartree
zpe.sumelectthermal: -824.582359 hartree
zpe.sumelectthermalent: -824.581415 hartree
zpe.sumelectthermalfe: -824.657164 hartree
dipole: -2.8647 -1.9595 -3.3273
dipole: 4.8080
quadrupole: -85.0069 -109.5164 -121.3261
quadrupole: 2.1695 1.8931 -3.2742
quadrupole: 20.2762 -4.2332 -16.0430 2.1695 1.8931 -3.2742
hfenergy: -824.9836438 hartree
pointgroup: C01 [X(C15H25N3O1)]
dipole: -1.1755152 0.8024217 1.2460064 debye
polarizability: 274.8885304|3.4306537|181.105332|-9.8655746|-8.6848909|137.121993 unknown
InChI: InChI=1S/C15H25N3O/c1-5-18(6-2)8-7-17-15(19)14-11(3)9-13(16)10-12(14)4/h9-10,17H,5-8,16H2,1-4H3
charge 0 multiplicity 1
44 atoms
O  0.245919 -1.049738 -1.163349
N  4.15365 0.198468 0.379553
N  0.40509 0.871622 0.123581
N  -5.955847 -0.417794 0.743736
C  2.721589 0.115943 0.761324
C  1.846881 1.032532 -0.137087
C  4.638968 -1.004924 -0.347857
C  5.056492 0.630129 1.477841
C  -1.795704 -0.193492 -0.10565
C  -0.323807 -0.169486 -0.434889
C  3.92686 -1.239595 -1.693921
C  6.374715 1.252569 0.975149
C  -2.649455 0.913722 -0.402505
C  -2.355283 -1.389163 0.449925
C  -4.030391 0.823802 -0.120769
C  -3.732619 -1.444543 0.737707
C  -4.591645 -0.344081 0.460778
C  -2.136157 2.19341 -1.053728
C  -1.488842 -2.602467 0.74467
H  2.587815 0.411617 1.821513
H  2.336802 -0.920623 0.666311
H  2.039557 0.772366 -1.190634
H  2.130133 2.089372 0.014238
H  5.719625 -0.871449 -0.537184
H  4.533808 -1.922865 0.288179
H  4.51691 1.394136 2.06885
H  5.289803 -0.211895 2.180904
H  -0.070836 1.510622 0.761492
H  4.348176 -2.135179 -2.188039
H  2.840836 -1.402597 -1.571577
H  4.074328 -0.372659 -2.363229
H  7.001848 0.521201 0.43462
H  6.159358 2.090922 0.289511
H  6.967848 1.632765 1.827982
H  -4.683903 1.669926 -0.369853
H  -4.151488 -2.358596 1.177414
H  -1.777677 2.925711 -0.303203
H  -1.299405 2.000217 -1.745212
H  -2.944515 2.685878 -1.621858
H  -1.070435 -3.016688 -0.188725
H  -0.623419 -2.339966 1.381804
H  -2.069474 -3.387055 1.259431
H  -6.360712 -1.263466 1.133853
H  -6.5744 0.359392 0.532401
