program: Gaussian 09
title: 000035236
version: EM64L-G09RevD.01
frameworkgroup: C1[X(C10H13N7)]
method: RPBEPBE
basis: SDD
operation: Freq
keyword: #pfreq=noraman
keyword: PBEPBE/SDD
title: #p freq=noraman PBEPBE/SDD
converged: NO YES NO NO
title: Mulliken charges:
elementType: N N N N N N N C C C C C C C C C C H H H H H H H H H H H H H
charge: -0.347938 -0.347921 -0.108614 -0.109597 -0.109965 -0.005342 -0.005395 -0.303998 -0.304188 0.061606 0.062148 -0.476854 -0.476865 0.074618 -0.749214 -0.137037 -0.136979 0.249486 0.249693 0.249161 0.249756 0.331931 0.331922 0.258855 0.259365 0.258859 0.259340 0.241745 0.241350 0.240069
chargesum: 0.00000
title: Mulliken charges with hydrogens summed into heavy atoms:
elementType: N N N N N N N C C C C C C C C C C
charge: -0.016007 -0.015998 -0.108614 -0.109597 -0.109965 -0.005342 -0.005395 0.195182 0.194729 0.061606 0.062148 0.041365 0.041335 0.074618 -0.026049 -0.137037 -0.136979
polarizability: 1.78992744e+02 -5.77714817e-02 2.06865657e+02 -9.27577941e-02 7.57290241e-01 8.39947045e+01
1716.lowfreq: -51.9302 -44.3188 -42.0312 -3.7817 -2.4943 -0.0007 -0.0004 -0.0003 0.7564
frequency: -51.9065 -44.3147 -42.0177 36.0852 36.1973 48.2483 75.9311 117.5726 122.8643 156.4295 184.2868 184.5012 218.5495 236.4690 257.5621 264.8075 321.4715 378.0754 378.2256 391.1977 473.4653 496.2179 499.3124 545.5920 553.9381 567.5282 611.1298 652.5615 705.6861 714.6811 771.4453 772.0800 801.8647 897.8477 932.9901 937.9439 964.2496 987.8386 1044.3962 1044.7222 1051.7104 1062.9939 1064.0025 1081.8966 1138.1409 1146.0856 1205.7754 1206.0591 1206.5290 1272.1218 1272.4176 1274.2019 1291.2585 1316.2910 1336.7510 1359.0617 1364.3439 1391.5628 1421.1542 1454.4414 1455.0621 1455.4964 1456.6302 1494.2305 1494.8891 1501.4448 1506.9477 1525.0170 1585.4084 2206.5502 2206.6640 2985.7268 2985.7762 2996.7752 3001.1508 3002.4255 3033.7258 3034.0633 3060.0511 3060.6679 3087.4110 3131.9700 3562.0377 3562.9884
redmass: 2.1138 1.9937 1.0145 5.7041 10.2899 5.1394 7.8495 4.3576 3.8440 6.5110 5.1484 5.1314 7.0613 4.2728 5.6905 5.0572 3.4885 3.6495 3.6441 6.4302 5.4481 1.1856 1.0965 5.2059 6.3348 5.9874 3.5613 6.3529 6.0499 10.0033 1.1988 1.1803 9.7449 13.1547 5.1186 6.1189 4.7968 2.0510 2.8580 2.8706 1.6476 1.6817 1.6769 6.1289 3.4214 3.7279 3.8802 1.1604 1.1499 1.3164 1.3232 1.0768 1.4616 1.8627 1.8402 1.6591 1.6161 1.3052 2.4449 1.1358 1.0903 1.0943 1.1138 2.4200 1.1546 1.2304 2.4070 5.1771 6.4761 12.4563 12.4567 1.0586 1.0586 1.0402 1.0584 1.0585 1.1022 1.1022 1.1049 1.1050 1.0919 1.1019 1.0772 1.0773
irintensity: 0.0011 0.1587 0.1119 0.0007 0.0007 5.0273 6.5560 0.0697 31.0941 0.4070 4.6691 4.3828 0.0045 0.5088 0.0791 7.6338 4.4618 0.1009 2.9925 6.6230 1.1669 173.3305 0.1372 1.1194 21.7515 7.8409 17.2460 0.5390 2.6697 0.0009 0.0067 5.2903 27.5952 11.1849 0.1513 1.4992 5.7949 9.8775 1.2472 1.1777 12.0023 0.0003 0.2375 0.2577 17.0780 1.4328 8.9710 0.3116 0.3053 0.2447 0.1677 0.1700 10.0691 0.2496 4.4372 55.6244 72.0930 27.5845 154.0811 12.0090 0.7946 24.7682 70.9093 231.8596 259.7980 30.1770 72.1260 1135.7313 414.0287 4.6040 13.0546 12.5690 0.1483 7.6182 4.9945 37.8304 0.4794 0.4578 17.7848 29.1362 14.5594 9.8702 106.7366 11.5724
temp: 298.150 k
press: 1.00000 atm
elementType: 7 7 7 7 7 7 7 6 6 6 6 6 6 6 6 6 6 1 1 1 1 1 1 1 1 1 1 1 1 1
symmnumber: 1
zpe: 608264.4 jmol-1
zpe.correction: 0.231676 hartree
zpe.thermalcorrener: 0.247069 hartree
zpe.thermalcorrenthalpy: 0.248013 hartree
zpe.thermalcorrgfe: 0.186968 hartree
zpe.sumelectzpe: -770.868643 hartree
zpe.sumelectthermal: -770.853250 hartree
zpe.sumelectthermalent: -770.852306 hartree
zpe.sumelectthermalfe: -770.913351 hartree
dipole: 0.0040 5.6183 0.0670
dipole: 5.6187
quadrupole: -93.9799 -140.2125 -98.1386
quadrupole: -0.0335 0.0024 0.4563
quadrupole: 16.7971 -29.4355 12.6384 -0.0335 0.0024 0.4563
hfenergy: -771.1003191 hartree
pointgroup: C01 [X(C10H13N7)]
dipole: 0.0412194 -2.2100695 0.0214549 debye
polarizability: 179.0055164|-0.5977493|206.8557156|0.0531222|-0.4831083|83.9918741 unknown
InChI: InChI=1S/C10H13N7/c1-8-15-9(13-6-2-4-11)17-10(16-8)14-7-3-5-12/h13-14H,2-3,6-7H2,1H3
charge 0 multiplicity 1
30 atoms
N  -2.336822 -0.632897 -0.009272
N  2.360636 -0.541442 -0.004665
N  0.009952 -0.496343 -0.007027
N  1.263542 -2.603058 -0.016353
N  -1.160709 -2.650595 -0.01873
N  -4.374576 3.82461 0.015639
N  4.226963 3.990182 0.010016
C  -2.477842 0.827305 -0.004568
C  2.445768 0.922374 0.002094
C  -1.122692 -1.269941 -0.010653
C  1.171799 -1.225197 -0.008355
C  -3.985163 1.188775 0.007461
C  3.938408 1.341487 -0.004183
C  0.063671 -3.260328 -0.019556
C  0.09375 -4.765479 0.005598
C  -4.201944 2.644294 0.011742
C  4.099419 2.804136 0.003913
H  -1.986628 1.263107 -0.894151
H  -1.973731 1.257402 0.880416
H  1.937062 1.33254 0.894118
H  1.927155 1.340597 -0.880308
H  -3.154187 -1.245246 -0.014235
H  3.200486 -1.122649 -0.006261
H  -4.485474 0.759005 -0.882506
H  -4.471839 0.7555 0.903212
H  4.453225 0.923567 0.883142
H  4.442501 0.934291 -0.902523
H  -0.814212 -5.174122 -0.464346
H  0.996798 -5.138778 -0.502196
H  0.124183 -5.123097 1.052238
