program: Gaussian 09
title: 000035245
version: EM64L-G09RevD.01
frameworkgroup: C1[X(C21H16N4)]
method: RPBEPBE
basis: SDD
operation: Freq
keyword: #pfreq=noraman
keyword: PBEPBE/SDD
title: #p freq=noraman PBEPBE/SDD
converged: YES YES NO NO
title: Mulliken charges:
elementType: N N N N C C C C C C C C C C C C C C C C C C C C C H H H H H H H H H H H H H H H H
charge: -0.403241 -0.087409 -0.112381 -0.100904 -0.002965 -0.041403 0.285941 0.290462 -0.038733 0.463345 -0.349526 -0.336027 -0.350675 -0.348737 -0.453435 -0.326237 -0.232471 -0.234231 -0.231755 -0.232451 -0.228530 -0.228732 -0.198447 -0.219152 -0.257144 0.329952 0.270333 0.255558 0.270049 0.269441 0.223991 0.298399 0.229147 0.228856 0.228844 0.228372 0.230594 0.230176 0.227391 0.224233 0.229505
chargesum: 0.00000
title: Mulliken charges with hydrogens summed into heavy atoms:
elementType: N N N N C C C C C C C C C C C C C C C C C C C C C
charge: -0.073290 -0.087409 -0.112381 -0.100904 -0.002965 -0.041403 0.285941 0.290462 -0.038733 0.463345 -0.079193 -0.080469 -0.080625 -0.079296 -0.229445 -0.027837 -0.003324 -0.005375 -0.002911 -0.004080 0.002064 0.001444 0.028943 0.005080 -0.027639
polarizability: 4.30314543e+02 2.20142146e+00 3.52740733e+02 -1.50194023e-01 1.20492683e-01 9.42099816e+01
1716.lowfreq: -7.0250 -6.4268 -0.0006 -0.0001 0.0005 1.4645 16.6895 32.2460 34.2094
frequency: 16.6282 32.2295 34.2013 38.7031 58.5893 71.0333 81.4033 107.5472 159.5363 173.9028 213.6262 228.8149 232.6819 247.7237 271.9656 276.2351 366.2865 403.2808 405.0932 408.1001 417.5566 444.1411 475.4228 508.7924 525.1954 590.7170 613.8181 614.7707 619.4407 631.5991 656.4186 663.7079 677.0410 694.2970 701.6227 703.4261 712.2943 723.6496 767.4056 777.7063 802.8415 804.2436 838.2257 841.8336 850.3467 861.5431 866.0406 908.9452 915.4392 953.3032 957.4254 960.3336 972.4632 985.4251 990.0215 991.5840 993.8559 998.4884 999.5576 1008.0593 1009.8506 1020.5490 1021.0610 1027.1200 1073.0523 1074.6615 1081.3187 1096.9030 1130.3413 1170.5177 1171.6220 1172.0207 1173.7131 1179.5090 1185.7940 1200.3480 1247.8955 1279.3292 1305.4001 1311.3492 1331.4112 1349.5789 1382.6964 1390.1052 1391.5572 1406.2001 1426.8546 1438.3029 1443.9993 1461.8207 1483.0433 1485.8413 1487.3655 1503.8988 1552.2337 1588.1173 1590.0693 1601.3023 1611.8243 1613.7597 1616.8464 3112.4088 3127.1181 3127.9369 3131.3510 3140.2967 3141.0337 3144.3656 3155.3293 3156.5653 3165.9119 3168.8340 3171.5234 3175.2438 3177.9086 3197.2194 3516.2528
redmass: 3.7683 3.9005 3.8275 5.3615 5.5255 5.2204 5.7732 6.1699 5.1683 8.0909 6.2284 5.5224 5.5646 5.5831 4.7093 5.3058 7.8073 2.8288 2.8562 2.9230 7.0422 3.6826 3.5176 2.8399 7.6773 7.2023 6.5070 6.4648 6.5952 7.9708 7.0545 2.0947 4.7707 1.8548 1.8163 1.5572 7.5644 1.8066 1.7872 2.1925 2.3069 6.6305 3.2362 1.4966 6.3387 1.2498 1.2456 12.6156 1.4447 1.4531 1.4469 6.9720 1.3546 6.2387 6.2621 6.2433 1.3684 1.3364 1.3651 1.3337 1.3324 2.3136 2.2421 2.0337 1.7949 1.5389 1.6499 2.6862 3.5591 1.0652 1.0607 1.0574 1.1877 1.1242 1.1382 4.7990 2.9467 2.4430 1.4457 1.4102 1.5985 3.8559 5.7934 9.7693 9.5173 4.2203 2.8912 2.2816 2.5185 3.6893 3.0463 3.1587 2.7001 3.0298 3.5137 6.4341 6.5139 4.5626 6.1830 6.2372 6.1871 1.0885 1.0853 1.0854 1.0869 1.0896 1.0897 1.0934 1.0945 1.0949 1.0999 1.0947 1.0946 1.0985 1.0975 1.0942 1.0749
irintensity: 0.0013 0.0011 0.1110 0.7733 0.0682 0.2732 0.9666 0.1028 1.3448 0.0006 0.4643 0.1805 0.5022 0.6571 1.1743 0.1486 2.2222 0.0016 0.0003 0.0051 1.3173 0.0019 9.8400 18.0711 1.7754 17.5153 0.9167 0.5527 9.2641 29.9823 2.1618 20.1596 0.0197 1.4884 151.6889 8.8328 2.7957 2.1896 22.9212 214.5469 0.8616 2.2520 0.7096 0.7222 3.3936 0.2356 0.0011 5.8790 12.0041 1.9502 6.5871 3.7523 0.0278 1.8738 0.9628 0.7517 0.6376 1.0375 0.3542 0.1003 1.1580 29.0362 17.1265 5.4242 14.8414 4.1778 9.2825 5.9218 7.2574 1.3593 1.4463 0.3123 58.0804 33.0442 3.5583 3.7661 10.9775 9.2965 5.9500 0.1782 39.6660 208.8549 148.4172 27.8178 77.8642 402.6980 341.6742 1.7822 31.1195 550.4780 240.1258 496.5749 15.8274 272.9478 622.7201 1.6222 4.6808 93.3901 22.6749 3.6748 31.1566 12.4597 0.0130 0.0223 0.6950 13.8834 14.6843 27.8852 32.6935 28.5069 32.0858 10.3605 12.6904 25.6287 14.0078 17.2012 35.8322
temp: 298.150 k
press: 1.00000 atm
elementType: 7 7 7 7 6 6 6 6 6 6 6 6 6 6 6 6 6 6 6 6 6 6 6 6 6 1 1 1 1 1 1 1 1 1 1 1 1 1 1 1 1
symmnumber: 1
zpe: 835861.1 jmol-1
zpe.correction: 0.318363 hartree
zpe.thermalcorrener: 0.337923 hartree
zpe.thermalcorrenthalpy: 0.338867 hartree
zpe.thermalcorrgfe: 0.267202 hartree
zpe.sumelectzpe: -1027.177933 hartree
zpe.sumelectthermal: -1027.158373 hartree
zpe.sumelectthermalent: -1027.157429 hartree
zpe.sumelectthermalfe: -1027.229093 hartree
dipole: 0.1753 -0.5556 -0.0033
dipole: 0.5826
quadrupole: -121.5353 -117.3546 -154.9466
quadrupole: -0.0615 -0.0464 0.0410
quadrupole: 9.7435 13.9242 -23.6677 -0.0615 -0.0464 0.0410
hfenergy: -1027.4962958 hartree
pointgroup: C01 [X(C21H16N4)]
dipole: -0.0586836 -0.2212946 0.0113133 debye
polarizability: 430.2636946|1.1959482|352.2571737|-5.4705836|-10.7410444|94.7443892 unknown
InChI: InChI=1S/C21H16N4/c1-4-10-16(11-5-1)19-23-20(17-12-6-2-7-13-17)25-21(24-19)22-18-14-8-3-9-15-18/h1-15,22H
charge 0 multiplicity 1
41 atoms
N  -1.535242 -1.99195 0.110157
N  1.508958 0.759022 -0.051226
N  0.724792 -1.527618 0.054353
N  -0.875482 0.312267 0.0027
C  0.201057 1.165194 -0.048244
C  1.724373 -0.600915 0.000706
C  -0.072765 2.623824 -0.10329
C  3.128458 -1.082753 -0.001441
C  -0.559227 -1.018287 0.053321
C  -2.952566 -1.91713 0.12801
C  1.004991 3.547701 -0.165917
C  -1.406872 3.111023 -0.09392
C  4.200955 -0.152692 -0.050152
C  3.411322 -2.474303 0.045103
C  -3.655662 -3.152593 0.198526
C  -3.68236 -0.699602 0.079346
C  0.750837 4.933187 -0.218284
C  -1.658484 4.49694 -0.146295
C  5.535028 -0.60853 -0.052323
C  4.746261 -2.926548 0.042491
C  -0.580933 5.412924 -0.208727
C  5.812305 -1.995829 -0.006209
C  -5.063769 -3.170679 0.220427
C  -5.092959 -0.735256 0.102272
C  -5.79474 -1.960193 0.172588
H  -1.128334 -2.931409 0.145257
H  2.025634 3.154816 -0.172533
H  -2.228632 2.391456 -0.04476
H  3.962635 0.914167 -0.085292
H  2.573564 -3.176773 0.082529
H  -3.096888 -4.096777 0.236419
H  -3.133963 0.241156 0.024521
H  1.586709 5.639726 -0.266563
H  -2.690302 4.864951 -0.138328
H  6.358539 0.113035 -0.089837
H  4.958964 -4.000703 0.078324
H  -0.777347 6.490317 -0.249499
H  6.849791 -2.349032 -0.008232
H  -5.589662 -4.130166 0.275181
H  -5.647882 0.209091 0.06426
H  -6.889502 -1.97366 0.189679
