program: Gaussian 09
title: 000035232
version: EM64L-G09RevD.01
frameworkgroup: C1[X(C5H10N6)]
method: RPBEPBE
basis: SDD
operation: Freq
keyword: #pfreq=noraman
keyword: PBEPBE/SDD
title: #p freq=noraman PBEPBE/SDD
converged: YES YES NO NO
title: Mulliken charges:
elementType: N N N N N N C C C C C H H H H H H H H H H
charge: -0.335529 -0.105829 -0.111435 -0.108893 -0.342025 -0.507527 0.064025 0.091252 0.021509 -0.748553 -0.604299 0.329487 0.243340 0.237236 0.237244 0.243943 0.212663 0.244088 0.340369 0.299344 0.299592
chargesum: 0.00000
title: Mulliken charges with hydrogens summed into heavy atoms:
elementType: N N N N N N C C C C C
charge: -0.006043 -0.105829 -0.111435 -0.108893 -0.001657 0.091408 0.064025 0.091252 0.021509 -0.030733 0.096395
polarizability: 1.24659548e+02 -1.56065753e+00 1.21594893e+02 -4.34470796e-01 -6.98306231e-02 5.49899799e+01
1716.lowfreq: -21.5766 -6.9810 -6.2870 -0.0003 0.0004 0.0005 5.9081 70.6866 95.7581
frequency: -21.3967 70.5394 95.7403 113.3379 143.4631 167.8687 201.1743 218.5055 219.3690 233.6049 312.1254 446.3824 490.2687 540.0707 543.2005 592.2765 609.5532 637.2292 669.4228 719.4743 793.4291 802.6617 896.0234 943.3678 977.8107 1027.1242 1051.5228 1125.0102 1137.7805 1162.4931 1202.1024 1224.8023 1289.6368 1307.3824 1345.1685 1387.3761 1410.8962 1433.9665 1456.1766 1456.8350 1457.7935 1484.6772 1494.2963 1498.5522 1522.6117 1584.9896 1683.2325 2984.4760 2997.7473 3061.5082 3084.0021 3104.5873 3131.6447 3389.0385 3501.4907 3574.5198 3581.4134
redmass: 1.0251 1.0589 3.8968 3.2062 3.4066 1.5542 2.9255 3.4205 3.4269 4.1729 2.8565 4.7198 5.4254 1.2657 4.1321 1.0898 3.4590 4.2367 4.0130 9.6927 1.8373 9.7334 12.8482 5.1712 2.3019 2.0321 1.6285 1.2824 3.0394 2.6475 4.1615 4.2174 1.1527 2.8640 2.0869 1.2811 2.3663 1.3487 1.1400 1.1015 1.0421 1.4884 2.5139 1.6485 5.4590 5.3257 1.0628 1.0345 1.0386 1.1011 1.0947 1.1005 1.1008 1.0426 1.0988 1.0787 1.0774
irintensity: 0.4400 0.2323 0.0980 4.8346 0.0044 10.7867 14.3911 7.0345 6.4526 0.1534 0.5817 15.3087 2.8121 99.5651 17.5449 155.0647 14.6599 11.2804 27.7873 6.1941 155.0282 21.0837 11.8934 5.0522 0.6818 10.5648 8.3920 1.8142 11.5085 0.7187 2.2062 12.6452 0.0579 0.1530 10.4421 3.7044 191.6025 130.5501 15.0409 26.6417 9.4321 46.8841 213.5676 134.1880 821.9789 363.5189 26.4177 60.3553 8.6923 32.9669 14.4343 25.5468 11.7127 0.4477 0.9491 86.9242 54.8273
temp: 298.150 k
press: 1.00000 atm
elementType: 7 7 7 7 7 7 6 6 6 6 6 1 1 1 1 1 1 1 1 1 1
symmnumber: 1
zpe: 440176.4 jmol-1
zpe.correction: 0.167654 hartree
zpe.thermalcorrener: 0.178669 hartree
zpe.thermalcorrenthalpy: 0.179613 hartree
zpe.thermalcorrgfe: 0.130759 hartree
zpe.sumelectzpe: -524.194054 hartree
zpe.sumelectthermal: -524.183040 hartree
zpe.sumelectthermalent: -524.182096 hartree
zpe.sumelectthermalfe: -524.230950 hartree
dipole: 2.2866 -1.7663 0.0631
dipole: 2.8901
quadrupole: -58.0271 -62.7678 -64.9403
quadrupole: -4.7669 -0.1626 -0.0289
quadrupole: 3.8846 -0.8561 -3.0286 -4.7669 -0.1626 -0.0289
hfenergy: -524.3617088 hartree
pointgroup: C01 [X(C5H10N6)]
dipole: 0.9336787 0.647544 -0.0421519 debye
dipolederiv: -0.9253337 -0.5469653 0.0161144 -0.6827456 -0.9141677 0.0115241 0.0242138 0.0139765 -0.4942743 -1.4006505 -0.520816 0.0071379 -0.1347386 -0.8210571 0.0149301 -0.0023423 0.0208717 -0.2198211 -0.5693058 -0.217684 0.0052404 -0.2393194 -1.4706512 0.0438641 0.0099145 0.043058 -0.2244786 -1.0616851 0.6096027 -0.0295125 0.219226 -1.1523227 0.0415099 -0.0137241 0.0335051 -0.2135546 -0.0327173 0.1667941 -0.0036579 0.4471899 -1.1196203 0.02753 -0.0142521 0.0294444 -0.4864934 -0.0306314 -0.0804797 0.0023114 0.0688437 -0.564915 0.0186727 -0.0015296 0.0163868 -0.0321552 1.3185643 0.6259845 -0.0148075 0.6811055 1.5498972 -0.0443511 -0.0270947 -0.0457903 0.21094 1.2193837 0.0050296 0.0281943 -0.0057574 1.2038089 -0.0461596 0.0641081 -0.051837 0.0458206 0.824586 -0.2741919 0.0152833 -0.2954968 1.9045222 -0.0649488 0.007296 -0.0600429 0.2124076 -0.3506174 0.087472 -0.0231525 0.1869196 0.0082002 0.0059889 -0.1092156 0.0205775 0.0055148 0.5768143 0.1381478 -0.0019547 -0.0236292 0.1863778 0.0013486 0.0022681 0.0009779 0.2414126 0.0961218 0.0099799 -0.0009619 0.0448539 0.2488292 0.0033657 -0.0024216 0.0027865 0.3340985 0.033999 -0.0450486 0.0210316 -0.1326567 -0.0289501 0.0475088 0.0525353 0.0355976 0.1076136 0.064184 0.0050378 0.0085631 0.0353409 -0.0027354 -0.1138456 0.0689543 -0.1091239 0.0299265 0.0449763 0.0140852 -0.0259194 0.0122115 0.0962901 0.0650278 -0.0621349 0.0627573 -0.0715135 -0.0271267 -0.0295223 -0.0304447 0.0967275 0.0780433 0.095747 -0.0982166 0.0542198 -0.0750758 0.0217165 -0.0648355 0.0021116 -0.1462279 -0.1345464 0.0101795 0.0053965 0.0107015 0.1253606 -0.0258742 -0.0257454 0.0313269 0.1047986 0.0649774 -0.1058908 0.0895598 -0.0656327 -0.0603173 0.0770562 0.0632718 -0.003788 0.0157835 0.2722588 0.0020817 -0.0019844 0.000552 0.3501861 0.072788 0.0408075 0.0271585 -0.1261036 0.3064224 0.1453583 0.0192263 0.1037174 0.0981182 0.0737521 0.0390756 -0.0302743 -0.1263253 0.2893382 -0.1594413 -0.0105568 -0.1167033 0.1162847 unknown
polarizability: 124.8003094|1.43016|121.3525526|0.8372149|-2.484518|55.0915586 unknown
InChI: InChI=1S/C5H10N6/c1-3-8-4(7-2)10-5(9-3)11-6/h7,11H,6H2,1-2H3
charge 0 multiplicity 1
21 atoms
N  1.280183 2.049337 -0.015339
N  -0.948425 1.349117 0.002979
N  0.891053 -0.271415 0.065946
N  -1.443796 -1.024094 0.084079
N  0.318749 -2.55539 0.146059
N  1.666016 -2.985855 0.164562
C  0.391645 1.008096 0.01868
C  -1.814746 0.291513 0.035488
C  -0.079179 -1.236344 0.096395
C  -3.288311 0.604101 -0.001141
C  2.733831 1.875819 -0.004317
H  0.860576 2.978521 -0.049593
H  -3.873297 -0.292457 0.25231
H  -3.522712 1.425656 0.696374
H  -3.576898 0.944161 -1.013094
H  3.067291 1.352917 0.910392
H  3.211247 2.86867 -0.04438
H  3.07149 1.278991 -0.870871
H  -0.40591 -3.273078 0.164367
H  2.156734 -2.682092 -0.688765
H  2.151059 -2.626075 0.999069
