program: Gaussian 09
title: 000035235
version: EM64L-G09RevD.01
frameworkgroup: C1[X(C10H19N5O2)]
method: RPBEPBE
basis: SDD
operation: Freq
keyword: #p
keyword: freq=noraman
keyword: PBEPBE/SDD
title: #p freq=noraman PBEPBE/SDD
converged: YES YES NO NO
title: Mulliken charges:
elementType: O O N N N N N C C C C C C C C C C H H H H H H H H H H H H H H H H H H H
charge: -0.291093 -0.291378 -0.329382 -0.329429 -0.160800 -0.113495 -0.112990 -0.379283 -0.377766 -0.252425 -0.253380 0.067106 0.066580 0.069911 -0.752281 -0.491482 -0.491474 0.246273 0.226598 0.226413 0.246023 0.340933 0.341320 0.193520 0.203675 0.203724 0.193723 0.238194 0.238289 0.235118 0.235586 0.205668 0.203247 0.235667 0.205731 0.203360
chargesum: 0.00000
title: Mulliken charges with hydrogens summed into heavy atoms:
elementType: O O N N N N N C C C C C C C C C C
charge: -0.291093 -0.291378 0.011551 0.011892 -0.160800 -0.113495 -0.112990 0.093588 0.094670 0.144770 0.144067 0.067106 0.066580 0.069911 -0.040680 0.153019 0.153283
polarizability: 2.17379317e+02 2.28501426e-01 1.71722574e+02 -9.25269524e+00 8.90844229e-01 9.98683718e+01
1716.lowfreq: -32.7390 -6.8040 -4.0339 -0.0006 -0.0001 0.0004 2.3508 16.1598 24.2238
frequency: -32.7331 16.1117 24.2187 35.0922 53.9631 72.4123 91.8326 92.6222 99.0940 112.8548 175.9180 179.3064 192.1926 196.4131 216.1061 218.4171 269.1540 272.4005 280.1396 317.1632 356.6891 443.2586 482.6753 501.0697 532.8408 547.3624 599.8388 642.0467 658.4536 675.5473 678.8140 714.0823 793.6225 797.2073 801.5469 887.0699 889.9570 897.3202 970.6609 978.2105 999.0834 1009.4572 1051.3962 1061.6579 1065.9827 1076.5275 1089.0686 1098.9682 1119.6235 1119.8725 1139.7464 1149.1928 1160.6112 1167.6752 1203.2353 1205.9393 1207.9833 1237.8178 1251.5020 1318.7026 1330.8501 1348.9295 1356.6866 1372.8498 1374.4102 1388.5275 1415.5469 1437.8753 1437.9861 1453.4216 1456.3738 1458.4840 1458.5845 1464.5546 1465.0147 1465.2097 1466.1148 1479.6651 1480.4505 1487.9296 1510.3307 1539.7623 1594.0350 2926.5663 2926.8957 2935.2051 2935.5710 2972.9424 2973.4410 2994.2770 2995.8642 2996.2032 3006.2027 3006.5085 3084.4425 3085.0150 3085.2011 3106.3071 3106.3998 3129.8342 3557.9156 3559.1734
redmass: 1.0144 3.7248 4.1617 3.8647 3.5421 2.5805 2.2003 3.1786 3.2937 3.6283 6.1224 4.7588 3.0484 4.7726 1.3964 1.5071 2.2194 2.2869 2.8822 3.2278 2.5357 3.3252 4.0694 3.2666 2.8656 5.4812 3.3467 4.4388 1.9677 1.2141 1.4608 7.6067 2.6985 7.9933 2.9540 2.8859 2.2034 12.7199 2.2912 2.7495 2.9799 2.2652 1.6390 2.7256 3.3836 2.8766 1.9601 2.2698 1.4077 1.4080 1.7031 2.6069 1.6823 2.0562 1.1824 1.6897 1.9194 1.4393 1.3355 1.7735 1.6963 1.5518 1.5450 1.3986 1.4204 1.3315 2.4726 1.1536 1.1561 1.1296 1.1244 1.0516 1.0515 1.0804 1.0781 1.0784 1.0845 1.1593 1.0725 2.6348 2.5323 6.0961 6.2863 1.0444 1.0441 1.0446 1.0448 1.0789 1.0797 1.0403 1.0952 1.0947 1.1031 1.1031 1.0938 1.0938 1.0919 1.0976 1.0977 1.1019 1.0764 1.0766
irintensity: 0.0540 1.4166 0.1592 1.0884 2.1236 2.2135 7.6080 5.6082 4.5959 5.1623 4.2251 0.0597 1.3356 0.1031 5.9281 2.3795 3.3248 5.1371 4.7690 2.1541 0.6545 16.1483 12.2136 0.7413 1.9086 10.3520 3.8578 1.1504 0.8189 216.2256 25.7450 0.5937 6.3774 31.4117 2.6633 0.2417 22.4782 11.8201 10.7141 2.7837 5.1552 65.1824 10.4198 182.9748 0.5546 104.7731 2.1081 4.3284 2.7928 2.3343 0.7530 30.9277 56.6366 15.8456 0.2078 11.6449 3.0522 30.6453 100.9097 27.3055 16.4529 19.0236 90.0056 6.8904 1.3573 15.2892 141.6604 2.3581 5.3861 14.8165 97.4617 12.0326 9.8990 90.8083 15.6687 1.1542 23.5434 23.4363 8.5346 287.0666 4.4074 1405.7336 314.9600 55.5834 37.0605 128.3204 93.3407 3.6063 1.7587 15.5608 123.8032 152.7963 56.5889 58.0824 7.9654 8.9433 15.8564 31.0308 26.6077 11.8268 178.4780 9.5561
temp: 298.150 k
press: 1.00000 atm
elementType: 8 8 7 7 7 7 7 6 6 6 6 6 6 6 6 6 6 1 1 1 1 1 1 1 1 1 1 1 1 1 1 1 1 1 1 1
symmnumber: 1
zpe: 784303.4 jmol-1
zpe.correction: 0.298725 hartree
zpe.thermalcorrener: 0.317287 hartree
zpe.thermalcorrenthalpy: 0.318232 hartree
zpe.thermalcorrgfe: 0.248635 hartree
zpe.sumelectzpe: -815.317591 hartree
zpe.sumelectthermal: -815.299029 hartree
zpe.sumelectthermalent: -815.298085 hartree
zpe.sumelectthermalfe: -815.367681 hartree
dipole: -0.0211 -4.3779 0.0884
dipole: 4.3788
quadrupole: -76.0591 -96.1884 -103.2191
quadrupole: 0.1341 12.3065 0.3077
quadrupole: 15.7631 -4.3662 -11.3969 0.1341 12.3065 0.3077
hfenergy: -815.6163163 hartree
pointgroup: C01 [X(C10H19N5O2)]
dipole: -0.0038524 1.7224 -0.0352046 debye
polarizability: 216.6876365|-0.342784|171.7239359|12.8966023|0.8502725|100.5586898 unknown
InChI: InChI=1S/C10H19N5O2/c1-8-13-9(11-4-6-16-2)15-10(14-8)12-5-7-17-3/h11-12H,4-7H2,1-3H3
charge 0 multiplicity 1
36 atoms
O  4.849428 1.234973 0.464628
O  -4.840026 1.247522 -0.476284
N  2.291629 0.044837 0.584651
N  -2.286911 0.054605 -0.552123
N  0.002644 0.143914 0.015508
N  -1.181101 -1.980637 -0.273739
N  1.177111 -1.985496 0.305336
C  2.466332 1.496665 0.614623
C  -2.454434 1.50733 -0.58561
C  3.710707 1.907721 -0.176565
C  -3.712047 1.921655 0.182351
C  1.119951 -0.601941 0.292523
C  -1.117472 -0.597071 -0.262893
C  -0.002914 -2.611045 0.013943
C  0.00171 -4.118473 -0.015888
C  6.108794 1.462165 -0.240644
C  -6.111072 1.4770 0.207088
H  1.560038 1.955925 0.186584
H  2.575798 1.853617 1.658607
H  -2.542206 1.865297 -1.631365
H  -1.554805 1.963375 -0.140355
H  3.103965 -0.543321 0.782107
H  -3.101498 -0.52923 -0.753303
H  3.844812 3.011517 -0.140679
H  3.624357 1.586891 -1.237577
H  -3.644563 1.603966 1.245682
H  -3.844773 3.025356 0.140823
H  0.753389 -4.512151 0.686232
H  -0.999583 -4.508009 0.225655
H  0.268106 -4.473248 -1.029663
H  6.881482 0.912977 0.319685
H  6.066057 1.079485 -1.282485
H  6.369975 2.541476 -0.266031
H  -6.8742 0.92563 -0.364062
H  -6.085518 1.0981 1.250868
H  -6.372761 2.556324 0.224173
