program: Gaussian 09
title: 000037358
version: EM64L-G09RevD.01
frameworkgroup: C1[X(C18H19N)]
method: RPBEPBE
basis: SDD
operation: Freq
keyword: #pfreq=noraman
keyword: PBEPBE/SDD
title: #p freq=noraman PBEPBE/SDD
converged: YES YES NO NO
title: Mulliken charges:
elementType: N C C C C C C C C C C C C C C C C C C H H H H H H H H H H H H H H H H H H H
charge: -0.566971 0.015703 -0.624614 0.387721 -0.550328 0.286003 0.373884 0.281837 0.155580 -0.573822 -0.466677 -0.448565 -0.372253 -0.239171 -0.402115 -0.413898 -0.763112 -0.252312 -0.261255 0.213599 0.230659 0.237762 0.219038 0.216099 0.227759 0.237704 0.239487 0.233122 0.223306 0.244814 0.221266 0.220711 0.238538 0.238310 0.227820 0.228243 0.260295 0.275832
chargesum: 0.00000
title: Mulliken charges with hydrogens summed into heavy atoms:
elementType: N C C C C C C C C C C C C C C C C C C
charge: -0.030844 0.015703 -0.180356 0.387721 -0.093528 0.286003 0.373884 0.281837 0.155580 -0.129964 -0.228973 -0.209079 -0.139131 -0.015865 -0.157301 0.028080 -0.286263 -0.024491 -0.033012
polarizability: 2.25958088e+02 -1.08394575e+01 2.14166258e+02 6.80582652e+00 1.90321505e+01 1.45361465e+02
1716.lowfreq: -0.0004 -0.0003 0.0005 2.4586 8.4653 10.2241 40.6976 43.4135 55.8354
frequency: 40.6739 43.3954 55.8214 95.8534 110.3268 128.5957 150.2042 181.9312 218.7659 235.4276 249.1743 270.1376 282.9491 312.5512 348.0088 364.9226 398.1092 415.4258 444.8511 480.4114 506.8983 524.4651 544.6562 577.8714 594.7371 603.3962 628.1648 657.6002 661.4468 698.4363 724.3396 738.5550 766.8819 776.6586 783.1178 795.5971 813.2000 829.8947 872.8066 887.3290 905.7805 936.6441 942.1457 952.0231 961.9950 977.8572 985.2620 987.4491 1022.4391 1036.6916 1057.8550 1064.3605 1082.2573 1094.3312 1104.5493 1124.3484 1153.7438 1161.3305 1174.8599 1177.2262 1201.2161 1220.6266 1227.4357 1252.8050 1255.5399 1274.3582 1288.9582 1311.7246 1316.5768 1326.8799 1351.6544 1371.2089 1373.0346 1379.5817 1414.5789 1429.2472 1445.4275 1454.7816 1458.6979 1471.4906 1478.2560 1481.9586 1495.8631 1575.1691 1584.9861 1600.5036 1605.1431 1624.6108 1636.8499 2900.5961 2960.5877 2986.7713 3006.8612 3014.1048 3021.8081 3047.6221 3067.6552 3091.8920 3110.3152 3115.1826 3123.7767 3125.2834 3139.9660 3151.8556 3159.9192 3197.4115 3450.4000 3577.8075
redmass: 3.9409 4.2914 4.1305 2.6713 2.3628 3.9544 3.0951 3.3406 1.1820 3.1170 3.9485 3.5243 2.6756 2.9459 4.0103 3.6654 3.5697 3.3649 2.5682 3.4517 4.1065 3.8395 3.4578 3.2477 3.1254 1.5647 3.7748 4.2919 5.3311 1.5474 3.0253 1.7472 1.5309 2.3740 1.7960 1.3175 2.7004 2.5090 1.5710 2.1490 1.4377 1.4457 1.7399 1.4770 2.2019 1.3858 1.5713 1.7581 2.3124 2.6094 2.4963 2.4263 2.3089 3.0620 1.8250 1.3481 2.2644 1.2371 1.0922 1.1376 2.0224 1.2688 1.3207 1.6823 2.2390 1.4513 1.1587 1.4580 2.3432 1.6161 2.3485 3.4111 3.7717 1.3597 1.3650 2.3082 1.3177 2.0744 2.3835 1.1393 1.1124 2.1990 1.0865 6.1505 7.1508 6.0224 6.1565 5.3734 1.0948 1.0700 1.0611 1.0640 1.0615 1.0953 1.0876 1.1014 1.1028 1.0617 1.0873 1.0857 1.0916 1.0869 1.0934 1.0992 1.1008 1.1145 1.0449 1.0973
irintensity: 0.3957 0.1730 0.8079 1.9749 3.2635 0.3206 0.3999 5.1574 41.6782 5.0640 0.2599 0.3326 5.7580 10.1826 6.1187 6.2590 1.5924 1.0050 4.0720 3.9129 5.9061 1.8699 1.0948 50.0420 61.2906 172.2807 1.8338 7.6503 0.2824 6.1075 6.2246 16.2390 9.6624 33.5207 42.5820 5.0775 17.2291 2.8574 1.0829 6.1648 0.6537 43.9653 11.3069 2.8164 0.2090 1.1069 0.1660 1.2112 0.5619 11.3640 6.8327 5.4913 2.6202 28.3180 7.5768 4.3283 2.7681 1.3871 0.1466 2.4534 0.4944 4.2837 1.1218 0.8088 2.6020 2.2987 3.9513 1.6813 12.3659 2.6681 1.3360 1.9647 2.2676 19.4529 3.9823 7.3945 9.6448 11.8354 4.2828 14.0455 10.9184 21.9727 5.8559 2.5699 5.8211 3.6392 0.3468 18.5663 33.3771 85.0582 24.3262 20.3796 28.7278 45.1802 24.0136 26.2874 32.4941 4.1382 11.1825 0.0583 24.5790 2.9558 28.0470 39.2350 30.7564 17.6354 1.0622 0.1672
temp: 298.150 k
press: 1.00000 atm
elementType: 7 6 6 6 6 6 6 6 6 6 6 6 6 6 6 6 6 6 6 1 1 1 1 1 1 1 1 1 1 1 1 1 1 1 1 1 1 1
symmnumber: 1
zpe: 836642.6 jmol-1
zpe.correction: 0.318660 hartree
zpe.thermalcorrener: 0.335360 hartree
zpe.thermalcorrenthalpy: 0.336305 hartree
zpe.thermalcorrgfe: 0.274494 hartree
zpe.sumelectzpe: -750.696455 hartree
zpe.sumelectthermal: -750.679755 hartree
zpe.sumelectthermalent: -750.678811 hartree
zpe.sumelectthermalfe: -750.740622 hartree
dipole: -1.6119 -0.1886 -0.4829
dipole: 1.6932
quadrupole: -111.7378 -102.1806 -111.9476
quadrupole: -5.0350 0.9825 3.2080
quadrupole: -3.1158 6.4414 -3.3256 -5.0350 0.9825 3.2080
hfenergy: -751.0151157 hartree
pointgroup: C01 [X(C18H19N1)]
dipole: 0.6316988 -0.0876109 0.1925274 debye
polarizability: 226.2756912|10.651596|214.1525074|7.0011738|-18.4069169|145.0576118 unknown
InChI: InChI=1S/C18H19N/c1-13-17-8-3-2-5-14(17)9-10-15-6-4-7-16(11-12-19)18(13)15/h2-8H,1,9-12,19H2
charge 0 multiplicity 1
38 atoms
N  -1.63724 4.025267 0.71312
C  -1.047541 -0.457769 -0.46982
C  0.241733 -2.640078 -0.539058
C  -1.015167 -1.857151 -0.203816
C  1.411654 -2.288065 0.414379
C  2.02493 -0.888858 0.298326
C  -2.1930 0.315409 -0.106217
C  0.147038 0.149446 -1.159453
C  1.461473 0.205255 -0.430072
C  -2.257567 1.828169 -0.265857
C  -2.128007 -2.487419 0.398744
C  -3.292417 -0.346948 0.500203
C  3.270035 -0.694411 0.955535
C  -3.270927 -1.735209 0.747506
C  2.174506 1.440119 -0.467428
C  -1.516705 2.563205 0.883481
C  0.031497 0.656088 -2.421236
C  3.962429 0.531625 0.912479
C  3.40881 1.611624 0.187235
H  0.039018 -3.723696 -0.453783
H  0.551922 -2.447603 -1.584528
H  1.06293 -2.434103 1.457896
H  2.225087 -3.024769 0.259606
H  -1.81302 2.151237 -1.224838
H  -3.307885 2.170344 -0.260207
H  -2.097942 -3.567211 0.588415
H  -4.173721 0.243191 0.779506
H  3.705517 -1.538006 1.506764
H  -4.136064 -2.225608 1.207787
H  1.725525 2.281391 -1.007554
H  -0.464701 2.193843 0.922898
H  -1.98851 2.288316 1.845775
H  -0.924142 0.636019 -2.956456
H  0.895999 1.062767 -2.958617
H  4.919237 0.643223 1.434591
H  3.926375 2.57623 0.142475
H  -1.208981 4.375691 -0.150444
H  -1.346177 4.571641 1.529563
