program: Gaussian 09
title: 000037720
version: EM64L-G09RevD.01
frameworkgroup: C1[X(C10H18O21S4)]
method: RPBEPBE
basis: SDD
operation: Freq
keyword: #p
keyword: freq=noraman
keyword: PBEPBE/SDD
title: #p freq=noraman PBEPBE/SDD
converged: NO YES NO NO
title: Mulliken charges:
elementType: S S S S O O O O O O O O O O O O O O O O O O O O O C C C C C C C C C C H H H H H H H H H H H H H H H H H H
charge: 1.188837 1.182885 1.219453 1.187673 -0.247777 -0.232057 -0.339005 -0.469814 -0.420837 -0.448335 -0.403618 -0.501227 -0.387682 -0.551283 -0.553863 -0.694756 -0.539445 -0.429668 -0.435941 -0.471136 -0.442372 -0.464325 -0.419847 -0.435756 -0.477939 0.009411 -0.181283 -0.108125 -0.066305 -0.122667 -0.119480 -0.062102 -0.358615 -0.074556 -0.408144 0.266083 0.357109 0.273057 0.277511 0.328900 0.305285 0.303155 0.272795 0.257105 0.312722 0.270644 0.282795 0.412705 0.398519 0.405195 0.415027 0.490489 0.450607
chargesum: 0.00000
title: Mulliken charges with hydrogens summed into heavy atoms:
elementType: S S S S O O O O O O O O O O O O O O O O O O O O O C C C C C C C C C C
charge: 1.188837 1.182885 1.219453 1.187673 -0.247777 -0.232057 -0.339005 -0.469814 -0.420837 -0.448335 -0.403618 -0.088522 0.010838 -0.146088 -0.138836 -0.204267 -0.088838 -0.429668 -0.435941 -0.471136 -0.442372 -0.464325 -0.419847 -0.435756 -0.477939 0.275493 0.175826 0.164932 0.211206 0.206233 0.185805 0.241053 0.171285 0.238166 0.145295
polarizability: 3.57509888e+02 -5.71232427e+00 3.80648694e+02 5.23418620e+00 -2.61614783e+00 2.53980494e+02
1716.lowfreq: -8.7423 -4.8313 0.0016 0.0023 0.0024 2.6953 10.3576 19.5884 20.5633
frequency: 9.9450 19.3275 20.2875 32.0312 35.2888 38.8645 44.8772 54.3894 56.9381 77.7017 88.8657 103.0324 106.9327 109.2819 113.3018 119.6746 124.9965 132.7301 142.4364 147.8037 149.2994 166.9751 167.8324 178.2875 184.3298 188.6734 193.1370 201.0228 214.2032 223.2522 238.7798 250.3612 251.8411 270.0861 276.4493 289.1281 291.7205 299.0387 305.8253 317.8368 324.2602 331.3957 339.8120 345.6852 348.8571 359.0402 370.3685 381.8397 384.2532 389.9458 398.3652 408.1144 423.1179 435.9149 449.3887 482.3856 488.5793 497.3127 511.7639 536.8671 539.3628 556.1719 565.2883 582.3561 586.7921 598.1392 607.1998 619.0555 627.4851 636.2187 645.4418 652.2011 721.1234 767.7762 800.6933 807.1059 822.8741 830.8615 837.2595 856.9394 863.3944 864.6570 865.5602 873.3521 874.2301 886.9987 923.2037 937.5764 946.1680 957.4316 964.7814 966.9333 971.6812 984.9955 993.4973 996.7155 1001.4087 1004.0052 1011.0482 1026.0289 1044.1512 1046.6558 1061.2365 1068.8889 1072.9051 1074.0110 1124.1017 1137.2338 1180.0407 1186.3072 1219.9732 1243.3554 1248.1831 1258.6899 1263.6759 1267.6496 1288.0749 1297.2917 1299.2541 1312.8015 1319.9611 1323.1829 1325.1846 1330.0669 1334.7706 1341.3262 1351.1409 1356.7380 1362.5948 1369.2281 1398.4877 1419.7163 1444.3826 1453.4513 1534.9688 1945.0989 2262.3176 2464.3737 2976.2555 3017.5949 3022.8851 3033.0845 3038.7856 3039.8609 3048.5974 3055.8567 3089.7273 3108.2016 3134.9383 3138.7558 3319.0144 3460.5540 3460.6552
redmass: 10.0232 9.9242 13.9569 12.3508 13.1256 13.0348 9.3128 12.3529 12.8506 11.5598 10.3191 9.5282 9.1104 6.1122 8.9612 8.2110 3.0719 3.5479 11.0632 8.3320 9.6525 6.8347 5.1956 8.1665 5.7220 7.7094 8.9792 6.7731 6.0855 6.5155 6.7097 7.0206 7.6458 6.2628 8.4550 7.4926 9.4265 7.9360 11.3115 11.2918 8.5799 5.2155 11.1309 10.5660 12.0393 5.3261 8.4378 11.3245 7.4485 10.1428 7.4902 8.2523 7.1824 4.3821 7.2185 5.4854 9.4690 5.5633 8.0790 8.6189 12.4016 6.0009 2.3647 1.6282 3.1327 3.3270 4.4805 7.9869 6.3177 4.7485 6.7078 5.5187 5.4308 4.8790 3.8606 3.7719 3.4236 1.0880 3.3900 3.7721 15.0623 14.8926 11.1723 7.6092 3.2834 7.0158 3.7304 5.9348 7.9566 3.9292 5.9532 1.8535 3.6058 6.2462 9.9535 7.2321 6.1160 3.8765 1.6425 3.0870 2.3474 2.5033 2.4223 2.2097 3.0279 1.7522 2.0259 2.0127 1.7197 1.3127 1.3092 1.1578 1.2287 1.1387 1.2483 1.1739 1.2279 1.4455 1.2441 1.3099 1.1822 1.2095 1.2535 1.2336 1.2433 1.2440 1.3479 1.2279 1.2763 1.2269 1.1638 1.1471 1.0840 1.0807 1.0598 1.1073 1.0867 1.0809 1.0842 1.0858 1.0846 1.0849 1.0719 1.0805 1.0865 1.0598 1.0885 1.0905 1.1085 1.1009 1.0674 1.0648 1.0663
irintensity: 1.6841 0.8955 1.2318 1.1091 0.6848 0.1275 0.6187 0.1046 0.4011 0.3924 1.2466 8.7541 4.0504 17.5912 2.0646 2.9206 20.9487 24.3645 5.8743 1.7003 0.8018 4.1553 10.4925 3.0834 30.6666 7.0853 8.9204 11.2098 7.2559 13.6975 8.8634 2.0875 5.1427 18.6700 14.3951 4.2398 26.1544 5.1147 5.5804 16.2667 3.6794 17.9035 48.3808 15.7829 2.2900 34.9254 74.7201 126.2919 5.5632 1.8873 69.9906 101.0338 64.3075 24.3015 49.5636 29.2741 45.6972 24.1181 46.6137 7.8018 160.9522 32.4039 55.0277 126.9860 37.5027 110.5375 166.1215 50.0416 55.3735 10.7025 14.4913 50.7070 200.8320 10.6524 68.5251 8.9787 33.2747 72.7600 40.8608 31.0727 105.3147 249.4889 83.2776 78.6575 36.3242 24.7231 41.0547 136.7878 95.2685 56.8828 5.1764 154.1379 47.2768 26.8321 14.9503 128.1356 96.7844 193.8102 8.8247 99.8290 38.8180 61.4761 74.6487 52.7267 297.8152 96.8700 8.2894 9.0068 4.3792 99.0617 21.7654 29.2715 50.4603 0.3061 49.4185 1.3043 4.2472 20.3379 4.0537 15.9202 50.9768 35.0548 23.1240 28.8031 14.6928 19.7039 34.0271 23.7309 3.3538 14.1715 51.8445 9.0664 19.1414 9.8811 128.7231 1712.2104 1214.7592 2625.6623 8.2069 6.5013 8.3033 8.8937 5.2749 32.7455 0.7163 7.2057 1.6366 1.0492 2.4688 2.7097 34.2208 43.0257 94.8586
temp: 298.150 k
press: 1.00000 atm
elementType: 16 16 16 16 8 8 8 8 8 8 8 8 8 8 8 8 8 8 8 8 8 8 8 8 8 6 6 6 6 6 6 6 6 6 6 1 1 1 1 1 1 1 1 1 1 1 1 1 1 1 1 1 1
symmnumber: 1
zpe: 867258.5 jmol-1
zpe.correction: 0.330321 hartree
zpe.thermalcorrener: 0.369110 hartree
zpe.thermalcorrenthalpy: 0.370054 hartree
zpe.thermalcorrgfe: 0.256808 hartree
zpe.sumelectzpe: -3560.186151 hartree
zpe.sumelectthermal: -3560.147362 hartree
zpe.sumelectthermalent: -3560.146417 hartree
zpe.sumelectthermalfe: -3560.259664 hartree
dipole: 2.7111 6.7013 0.2727
dipole: 7.2340
quadrupole: -285.4728 -243.0374 -254.2174
quadrupole: 24.7430 -14.3828 -5.5081
quadrupole: -24.5636 17.8718 6.6918 24.7430 -14.3828 -5.5081
hfenergy: -3560.5164719 hartree
pointgroup: C01 [X(C10H18O21S4)]
dipole: 1.752568 2.2423822 -0.0205084 debye
polarizability: 356.4196614|1.0842996|381.6643555|-0.1304183|-6.984591|254.0550591 unknown
InChI: InChI=1S/C10H18O21S4/c11-3-1-26-10(8(31-35(22,23)24)5(3)28-32(13,14)15)27-4-2-25-9(12)7(30-34(19,20)21)6(4)29-33(16,17)18/h3-13,16,19,22H,1-2H2
charge 0 multiplicity 1
53 atoms
S  4.339374 2.560214 -0.058048
S  -4.361171 3.040641 -0.313893
S  -2.271342 -2.491556 -1.141036
S  2.183457 -3.716012 1.049262
O  0.275537 0.475236 0.567419
O  -1.120645 0.989332 2.354735
O  1.045831 -1.123682 -1.960787
O  3.706356 0.933339 -0.767649
O  -2.740537 2.607868 0.646779
O  -1.820956 -0.722623 -0.645848
O  1.851649 -1.854061 0.685075
O  -3.945546 0.640349 2.178689
O  3.365476 -0.943202 -2.617673
O  3.129141 3.577547 -1.006682
O  -5.426555 1.912509 0.524851
O  -0.528891 -2.875872 -1.127972
O  0.512845 -4.174541 0.829451
O  5.820868 2.791674 -0.607584
O  3.966063 2.619536 1.501398
O  -4.158474 2.57043 -1.839061
O  -4.680485 4.554639 0.070647
O  -2.962559 -3.279307 0.074323
O  -2.874472 -2.541027 -2.620811
O  2.556146 -3.920565 2.585451
O  3.171778 -4.222783 -0.122162
C  1.238318 0.880644 -0.458643
C  2.606991 0.315478 0.021644
C  -1.955685 1.514304 0.077894
C  -0.718647 1.436409 1.042944
C  -2.746601 0.15654 0.074842
C  2.793633 -1.218319 -0.228637
C  -3.01584 -0.333223 1.529779
C  0.865041 0.344358 -1.85745
C  2.470266 -1.555869 -1.709721
C  -1.712599 -0.383873 2.333416
H  1.314816 1.987745 -0.515294
H  2.736598 0.518607 1.100073
H  -1.643338 1.750643 -0.955605
H  -0.286693 2.444842 1.179756
H  -3.690584 0.27274 -0.491213
H  3.843209 -1.497775 -0.012936
H  -3.529557 -1.307225 1.536033
H  1.495552 0.811643 -2.634787
H  -0.19469 0.514799 -2.088095
H  2.458205 -2.637768 -1.905446
H  -1.899045 -0.621862 3.390705
H  -0.994098 -1.098673 1.900648
H  -3.379623 1.341257 2.608738
H  3.772903 -0.115452 -2.221433
H  3.48184 4.513293 -1.087346
H  -4.870643 1.36712 1.26743
H  0.085969 -2.046155 -1.503254
H  0.078615 -3.668614 0.003482
