program: Gaussian 09
title: 000037355
version: EM64L-G09RevD.01
frameworkgroup: C1[X(C20H23N)]
method: RPBEPBE
basis: SDD
operation: Freq
keyword: #pfreq=noraman
keyword: PBEPBE/SDD
title: #p freq=noraman PBEPBE/SDD
converged: YES YES NO NO
title: Mulliken charges:
elementType: N C C C C C C C C C C C C C C C C C C C C H H H H H H H H H H H H H H H H H H H H H H H
charge: -0.071647 0.002375 0.390296 -0.624157 -0.550259 0.393671 0.283082 0.274780 -0.603523 0.154811 -0.380627 -0.469483 -0.447910 -0.241010 -0.371757 -0.402183 -0.763625 -0.253644 -0.260192 -0.622171 -0.617973 0.213670 0.230886 0.219312 0.237428 0.233356 0.220049 0.214316 0.225866 0.237914 0.240347 0.223106 0.233076 0.246761 0.238892 0.238443 0.227639 0.228994 0.230629 0.185118 0.220008 0.220097 0.188949 0.226290
chargesum: 0.00000
title: Mulliken charges with hydrogens summed into heavy atoms:
elementType: N C C C C C C C C C C C C C C C C C C C C
charge: -0.071647 0.002375 0.390296 -0.179601 -0.093519 0.393671 0.283082 0.274780 -0.150118 0.154811 0.059555 -0.231569 -0.207563 -0.017904 -0.138681 -0.155423 -0.286291 -0.026004 -0.031198 0.013585 0.017363
polarizability: 2.30708997e+02 3.97878274e+00 2.51128204e+02 -2.31610189e+01 -5.84023832e+00 1.69817904e+02
1716.lowfreq: -12.1573 -6.5848 -0.0006 -0.0006 -0.0005 2.7034 31.2484 32.9962 41.8692
frequency: 31.1752 32.6656 41.7782 50.0080 92.9240 107.4425 114.2271 145.8731 176.0677 204.2998 223.6228 233.5974 237.0460 248.6985 267.7235 284.7066 322.8242 336.9115 351.4211 391.9309 403.7428 426.2722 439.1206 443.3408 479.2964 510.8735 523.4457 545.6348 579.6040 595.5435 625.0421 650.7468 661.3553 697.2457 722.1898 737.3502 765.4552 776.0256 781.8452 794.2807 798.0931 827.0854 835.8872 872.8765 889.9265 908.7483 937.1310 950.3563 956.2943 976.1455 981.8011 986.2155 1011.5589 1022.5079 1032.8409 1036.6337 1053.5696 1059.2877 1066.3336 1082.3206 1092.2955 1104.8420 1130.0169 1152.7134 1155.3755 1163.6519 1174.4404 1177.7172 1200.7059 1221.1540 1227.2474 1252.1506 1253.0907 1263.5395 1273.3992 1296.5327 1303.6487 1315.8703 1326.2139 1351.3360 1367.6868 1371.5247 1372.9844 1413.4034 1418.9163 1429.4017 1442.6632 1443.7067 1454.1355 1457.7603 1461.0230 1464.2185 1470.9376 1476.1206 1476.7273 1481.1048 1483.0088 1489.1591 1575.1875 1584.8058 1600.4938 1604.9179 1624.6575 2836.2513 2849.2260 2865.8672 2960.0735 2986.2194 3013.0312 3015.6983 3016.8117 3018.3295 3026.7026 3047.1033 3075.0069 3079.2053 3085.3821 3091.0120 3110.1478 3114.7819 3123.4527 3125.2106 3139.8663 3151.4618 3159.5730 3196.5889
redmass: 3.9251 3.5934 2.8945 4.2139 3.3295 2.4407 3.5748 3.0540 3.2474 2.6795 2.4434 1.8526 1.6380 1.3326 3.1498 2.7871 3.5394 2.6012 3.2322 3.5859 3.0539 3.0132 2.4149 2.5844 3.4783 3.9780 3.9357 3.3877 4.1239 4.0910 3.6366 4.7445 5.2520 1.5079 3.1953 1.7682 1.5873 2.3884 1.6976 1.4578 2.8080 2.4897 3.4126 1.5409 2.2986 1.4031 1.3543 1.6180 2.0446 1.3731 2.0012 1.3752 2.8917 2.0681 1.6746 2.4897 2.4962 2.5407 2.2422 2.3734 1.2903 1.7397 1.3454 2.1467 1.6146 1.3121 1.0863 1.1398 2.0668 1.2758 1.6191 2.0409 1.8081 2.6169 1.4658 1.3348 1.4918 2.2955 1.5960 2.3077 1.3656 2.9982 4.0382 1.3542 1.1424 2.3053 1.1810 1.2381 2.1562 2.1275 1.0737 1.1220 1.1445 1.0815 1.0612 2.2160 1.0742 1.0771 6.1805 7.1469 6.0422 6.1841 5.4067 1.0584 1.0623 1.0638 1.0610 1.0643 1.0951 1.0614 1.0722 1.0870 1.0717 1.1012 1.1014 1.1006 1.0997 1.0618 1.0874 1.0856 1.0915 1.0869 1.0934 1.0992 1.1008 1.1146
irintensity: 0.1285 0.2196 0.4272 0.0887 0.3574 0.4558 0.3584 0.5217 2.9639 0.7159 0.6416 3.2530 0.2346 1.0717 0.7566 0.8858 1.5452 6.5389 3.5816 3.7293 1.1977 3.8181 1.0726 3.0564 3.0134 4.6918 1.0826 1.5217 5.1007 9.5130 2.3235 2.5008 0.0518 7.2346 4.6492 22.1022 13.2663 33.7978 35.8938 8.5835 10.3407 4.4532 15.8466 2.4488 8.1272 0.9317 60.9955 1.6821 0.1916 1.2643 1.0122 0.3246 6.8423 0.2553 24.4137 11.9151 23.0755 27.9794 8.1365 7.1264 4.8100 2.3461 10.2029 3.9796 2.0326 5.4049 0.1352 2.4271 0.3991 5.5789 3.7100 1.5275 3.2268 6.9552 3.0352 2.9790 12.6989 7.5646 3.0329 1.3101 10.9993 2.2841 2.4253 2.9920 3.5586 7.6096 5.6544 7.6076 10.8777 10.3053 14.0637 9.1463 14.4859 8.1568 14.9459 17.8081 12.3239 25.6311 2.1761 7.0629 4.3473 0.3203 17.9511 75.0658 71.6816 169.5473 24.9653 20.2816 50.2316 16.0139 49.5043 24.2845 57.2945 26.6482 11.8142 47.7009 38.7624 4.5805 11.3314 0.1102 24.6229 3.0075 29.3641 38.8790 29.5101 16.7106
temp: 298.150 k
press: 1.00000 atm
elementType: 7 6 6 6 6 6 6 6 6 6 6 6 6 6 6 6 6 6 6 6 6 1 1 1 1 1 1 1 1 1 1 1 1 1 1 1 1 1 1 1 1 1 1 1
symmnumber: 1
zpe: 979899.8 jmol-1
zpe.correction: 0.373224 hartree
zpe.thermalcorrener: 0.392572 hartree
zpe.thermalcorrenthalpy: 0.393516 hartree
zpe.thermalcorrgfe: 0.325144 hartree
zpe.sumelectzpe: -829.127814 hartree
zpe.sumelectthermal: -829.108466 hartree
zpe.sumelectthermalent: -829.107522 hartree
zpe.sumelectthermalfe: -829.175894 hartree
dipole: 0.7706 -0.8718 -0.6376
dipole: 1.3268
quadrupole: -120.2468 -119.4002 -124.4538
quadrupole: 4.3585 -3.5581 -1.9572
quadrupole: 1.1201 1.9667 -3.0869 4.3585 -3.5581 -1.9572
hfenergy: -829.501038 hartree
pointgroup: C01 [X(C20H23N1)]
dipole: 0.4131372 0.2035886 0.2456915 debye
polarizability: 231.300955|4.0995153|251.0048964|18.4868219|-14.1947827|169.3492536 unknown
InChI: InChI=1S/C20H23N/c1-15-19-10-5-4-7-16(19)11-12-17-8-6-9-18(20(15)17)13-14-21(2)3/h4-10H,1,11-14H2,2-3H3
charge 0 multiplicity 1
44 atoms
N  -3.523337 1.839709 0.348307
C  -0.115635 -1.328275 -0.505384
C  0.751468 -2.377085 -0.082609
C  2.245009 -2.232052 -0.314367
C  2.870106 -1.153801 0.606885
C  -1.51751 -1.406651 -0.241603
C  2.488251 0.308271 0.353262
C  0.502194 -0.167949 -1.242154
C  -2.486153 -0.277699 -0.568125
C  1.430493 0.753026 -0.499642
C  -2.504108 0.785441 0.564182
C  0.220766 -3.510337 0.574912
C  -2.018635 -2.556324 0.423636
C  -1.166044 -3.605372 0.824499
C  3.284987 1.285706 1.00863
C  1.220295 2.155181 -0.655421
C  0.208008 0.052577 -2.556117
C  3.067103 2.667983 0.84602
C  2.023547 3.107824 -0.000385
C  -3.193476 2.746883 -0.7689
C  -3.810598 2.591572 1.588067
H  2.748652 -3.195232 -0.111312
H  2.450314 -1.973487 -1.371387
H  3.973664 -1.229178 0.536128
H  2.614877 -1.406425 1.657098
H  -2.219655 0.205905 -1.522088
H  -3.51316 -0.672544 -0.671373
H  -1.476764 1.217457 0.679497
H  -2.745224 0.273883 1.515483
H  0.894771 -4.318018 0.885003
H  -3.094955 -2.620816 0.625094
H  -1.57777 -4.487921 1.326868
H  4.103593 0.943024 1.654899
H  0.390147 2.48765 -1.288965
H  -0.479944 -0.602248 -3.102166
H  0.677468 0.866101 -3.121211
H  3.701689 3.391576 1.369738
H  1.831563 4.177664 -0.138035
H  -3.093031 2.180228 -1.709978
H  -2.240693 3.31521 -0.602617
H  -4.009818 3.479228 -0.902994
H  -4.634502 3.305765 1.407378
H  -2.931657 3.170371 1.972287
H  -4.131995 1.893076 2.381157
