program: Gaussian 09
title: 000037434
version: EM64L-G09RevD.01
frameworkgroup: C1[X(C18H26N2O2)]
method: RPBEPBE
basis: SDD
operation: Freq
keyword: #p
keyword: freq=noraman
keyword: PBEPBE/SDD
title: #p freq=noraman PBEPBE/SDD
converged: YES YES NO NO
title: Mulliken charges:
elementType: O O N N C C C C C C C C C C C C C C C C C C H H H H H H H H H H H H H H H H H H H H H H H H H H
charge: -0.285198 -0.424142 -0.126158 -0.692809 -0.156181 -0.161955 -0.011973 -0.072718 -0.531758 -0.488971 -0.490457 -0.524888 -0.783394 -0.460049 0.152382 -0.282516 0.262966 -0.379507 -0.357600 -0.416419 -0.421350 0.496210 0.232679 0.226325 0.197069 0.208584 0.223732 0.216855 0.267771 0.213632 0.221790 0.208621 0.277664 0.208713 0.217406 0.218952 0.210738 0.213493 0.259208 0.214851 0.192305 0.269243 0.247217 0.351687 0.221956 0.219253 0.307415 0.309326
chargesum: 0.00000
title: Mulliken charges with hydrogens summed into heavy atoms:
elementType: O O N N C C C C C C C C C C C C C C C C C C
charge: -0.285198 -0.072455 -0.126158 -0.076069 0.076498 0.064370 0.185096 0.135866 -0.091170 -0.007568 -0.060045 -0.038511 -0.136298 0.012651 0.152382 0.124641 0.262966 -0.110264 -0.110383 -0.194462 -0.202097 0.496210
polarizability: 2.87738429e+02 -2.30216024e+01 1.75522651e+02 -5.57192751e+00 3.12399257e+00 1.82672814e+02
1716.lowfreq: -18.9388 -9.9545 -0.0004 0.0005 0.0008 4.0791 12.1397 24.0686 38.3464
frequency: -6.9955 24.0071 38.3153 54.5419 62.8012 76.3073 84.4703 99.0093 126.5673 157.6642 170.5617 191.2040 206.9622 218.9822 246.2833 283.5419 292.4621 310.9152 314.7552 344.7672 371.8516 378.1605 386.5004 389.6242 406.8228 411.6235 419.7312 456.8644 489.9599 502.9212 533.2222 563.3014 578.8456 592.3743 631.7057 673.7953 705.5289 728.0152 739.1597 747.7902 790.0062 804.3461 816.0274 823.0812 835.8839 836.7958 843.5083 866.9686 882.4895 899.3912 925.1745 928.4822 952.0487 961.1790 961.9098 967.4360 969.5069 992.2737 999.7493 1005.9380 1015.6807 1019.6356 1040.1716 1048.2612 1055.4939 1075.2438 1082.4092 1106.4546 1116.8763 1123.4759 1129.5037 1134.9074 1163.3696 1172.0889 1185.7124 1193.7716 1213.6223 1219.4973 1243.4231 1251.0151 1252.1298 1261.4227 1266.8294 1282.5604 1291.9907 1307.3689 1308.0867 1311.1671 1317.5129 1325.1740 1336.0375 1339.4247 1355.0693 1366.8409 1375.4903 1378.9331 1386.3135 1401.7504 1434.3285 1458.4103 1464.9411 1468.9449 1471.2618 1472.4099 1476.6686 1482.3683 1506.1650 1516.2894 1548.2400 1574.7894 1628.8600 1643.8805 2938.7208 2942.3542 2962.4581 2968.1621 2976.3913 2991.6326 2999.5091 3005.9563 3009.4123 3041.6022 3048.6763 3052.9612 3056.6819 3061.1127 3061.2703 3066.4683 3072.8491 3080.3820 3083.8251 3113.5131 3123.9997 3137.3875 3158.7114 3541.6623 3564.2992 3704.3029
redmass: 3.8925 4.6033 4.0968 5.3018 4.0850 4.4267 5.8766 3.6273 4.1599 3.8578 3.4939 2.8712 1.0497 4.8036 2.8092 2.0344 5.3129 1.1586 3.0681 2.4754 2.6067 1.3703 1.9377 1.3766 2.6660 2.4699 2.4094 2.0854 3.6044 2.7842 2.8286 3.0784 3.9067 3.7349 6.3923 3.9455 5.4524 3.3664 3.5026 4.6902 2.6571 1.6371 3.5998 1.3252 1.8789 2.0368 2.5540 2.8020 2.5881 2.2791 2.2336 2.4089 1.3687 1.7101 1.9760 1.4769 1.7358 1.7128 2.7543 1.5242 1.6607 1.7014 1.5780 3.1933 1.9609 1.4164 1.9296 1.6085 1.7386 1.4574 1.2351 1.5840 1.5380 2.2749 1.1436 1.7162 1.6454 1.4562 1.5114 1.3839 1.4027 1.3793 1.7803 1.3787 1.5063 1.3394 1.5417 1.4787 2.5660 1.4628 1.3873 1.4102 1.4295 1.2603 4.3807 1.3017 1.2101 2.0804 3.8021 1.0864 1.1378 1.0799 1.0864 1.0535 1.0656 1.0871 1.1059 3.0722 7.1249 6.9379 3.2399 1.4104 1.0828 1.0694 1.0363 1.0810 1.0706 1.0600 1.0593 1.0641 1.0657 1.0884 1.1018 1.0982 1.0915 1.0992 1.0949 1.1043 1.0951 1.1012 1.0969 1.0868 1.0890 1.0964 1.0956 1.0662 1.0450 1.1040
irintensity: 1.0317 0.3785 1.4737 0.9060 2.1710 2.5732 1.5014 5.0150 0.1682 1.8021 2.2066 1.3987 0.2259 4.4379 8.3738 5.1619 1.9631 153.3391 2.4928 5.5452 39.1760 242.3489 12.4122 74.4275 5.1124 0.4541 7.3873 1.0999 18.2151 2.4125 8.7570 7.5295 11.2688 9.8581 3.2413 2.6039 16.1111 0.7825 2.4694 7.7890 0.9040 2.2147 7.6047 3.4700 70.3111 7.9658 4.3683 2.1832 1.9557 5.2499 2.6307 2.6675 1.3081 1.9592 4.9114 3.9350 12.6115 2.7658 16.9953 19.3447 42.4635 40.2144 3.5793 3.3448 5.0654 6.8391 7.7976 17.1764 13.1354 4.0924 18.5500 6.5782 5.0028 1.5796 75.1012 4.3322 14.8614 1.3144 3.4104 54.1453 2.1808 6.8520 108.3747 4.3426 2.8899 0.6346 1.9646 11.0286 65.9497 57.4444 10.4081 6.1047 5.9125 11.3536 4.3830 6.4630 14.8113 192.1883 3.1860 22.4291 24.9092 2.9719 2.7516 6.3134 7.1921 21.0852 27.3277 48.0732 140.5733 40.4018 79.6248 339.4965 26.3197 81.7175 46.1049 14.9030 57.6194 37.1690 38.8529 56.8349 44.7581 87.5907 13.4965 51.2900 39.8468 36.0947 17.0644 33.9513 32.0404 31.3618 37.7330 15.5218 23.9670 17.7707 4.5248 13.7009 94.9835 21.8493
temp: 298.150 k
press: 1.00000 atm
elementType: 8 8 7 7 6 6 6 6 6 6 6 6 6 6 6 6 6 6 6 6 6 6 1 1 1 1 1 1 1 1 1 1 1 1 1 1 1 1 1 1 1 1 1 1 1 1 1 1
symmnumber: 1
zpe: 1079275.0 jmol-1
zpe.correction: 0.411074 hartree
zpe.thermalcorrener: 0.431811 hartree
zpe.thermalcorrenthalpy: 0.432756 hartree
zpe.thermalcorrgfe: 0.361491 hartree
zpe.sumelectzpe: -959.786881 hartree
zpe.sumelectthermal: -959.766143 hartree
zpe.sumelectthermalent: -959.765199 hartree
zpe.sumelectthermalfe: -959.836464 hartree
dipole: 2.9799 0.1170 -5.1740
dipole: 5.9719
quadrupole: -95.4468 -137.7436 -134.4372
quadrupole: -10.8538 -8.2057 0.4203
quadrupole: 27.0957 -15.2010 -11.8947 -10.8538 -8.2057 0.4203
hfenergy: -960.1979547 hartree
pointgroup: C01 [X(C18H26N2O2)]
dipole: 1.1610875 -0.0217841 2.042471 debye
polarizability: 289.5270754|18.1133047|173.9209072|5.4515743|3.2726999|182.4859115 unknown
InChI: InChI=1S/C18H26N2O2/c1-12-14-2-3-15(10-14)17(12)11-20(8-9-21)18(22)13-4-6-16(19)7-5-13/h4-7,12,14-15,17,21H,2-3,8-11,19H2,1H3
charge 0 multiplicity 1
48 atoms
O  0.382834 0.383419 -1.926271
O  1.707026 -3.194146 -0.544919
N  -0.158214 -0.856892 -0.020764
N  6.131242 0.979805 0.887966
C  -2.413356 1.297638 0.624687
C  -4.607567 1.043365 0.050328
C  -2.565035 -0.251029 0.471596
C  -4.067969 -0.425563 0.007082
C  -3.801113 1.655482 1.234564
C  -2.498291 2.005257 -0.76148
C  -4.01043 1.821518 -1.161766
C  -1.569682 -0.961647 -0.469971
C  -4.863924 -1.407158 0.891696
C  0.273481 -1.825282 1.006065
C  0.737935 -0.1258 -0.811704
C  0.623631 -3.222949 0.440197
C  2.13768 0.091291 -0.299283
C  3.224106 -0.093538 -1.1946
C  2.415369 0.611376 0.992492
C  4.545319 0.183598 -0.804471
C  3.731014 0.915311 1.389251
C  4.823491 0.694451 0.499196
H  -1.530585 1.593183 1.216614
H  -5.707492 1.101854 0.123733
H  -2.465444 -0.695072 1.486951
H  -4.096765 -0.794849 -1.038982
H  -3.957473 2.743635 1.348096
H  -3.99766 1.16366 2.205175
H  -1.792402 1.588278 -1.498664
H  -2.248163 3.076214 -0.647422
H  -4.512502 2.798558 -1.288112
H  -4.132569 1.261014 -2.107007
H  -1.615985 -0.538436 -1.486905
H  -1.844308 -2.033607 -0.547557
H  -4.938723 -1.037134 1.932103
H  -5.892443 -1.549587 0.509836
H  -4.378077 -2.401627 0.92544
H  -0.540028 -1.940472 1.748034
H  1.151801 -1.434201 1.544718
H  -0.2325 -3.664465 -0.097554
H  0.881023 -3.887745 1.294804
H  3.01153 -0.4477 -2.208717
H  1.588663 0.817701 1.683475
H  2.4419 -2.613528 -0.217652
H  5.369111 0.020631 -1.510119
H  3.917853 1.335787 2.385033
H  6.330905 1.365068 1.806323
H  6.905585 0.847631 0.243966
