program: Gaussian 09
title: 000037395
version: EM64L-G09RevD.01
frameworkgroup: C1[X(C19H21ClN2OS)]
method: RPBEPBE
basis: SDD
operation: Freq
keyword: #p
keyword: freq=noraman
keyword: PBEPBE/SDD
title: #p freq=noraman PBEPBE/SDD
converged: YES YES NO NO
title: Mulliken charges:
elementType: Cl S O N N C C C C C C C C C C C C C C C C C C C H H H H H H H H H H H H H H H H H H H H H
charge: -0.057916 0.187990 -0.269006 -0.421731 -0.046820 0.292657 0.297886 0.206302 -0.386438 -0.404922 -0.117631 -0.096567 -0.507701 -0.658007 -0.317432 -0.319668 -0.321032 0.280846 -0.358915 -0.292557 -0.235997 -0.557324 -0.562833 -0.536391 0.243911 0.224217 0.298435 0.218731 0.229231 0.217630 0.270837 0.253995 0.250028 0.263976 0.262573 0.246564 0.225701 0.229039 0.252928 0.281374 0.268963 0.273870 0.222820 0.220867 0.247521
chargesum: 0.00000
title: Mulliken charges with hydrogens summed into heavy atoms:
elementType: Cl S O N N C C C C C C C C C C C C C C C C C C C
charge: -0.057916 0.187990 -0.269006 -0.123296 -0.046820 0.292657 0.297886 0.206302 0.081689 0.043040 -0.117631 -0.096567 -0.290071 -0.133176 -0.067405 -0.055692 -0.058460 0.280846 -0.112351 -0.066856 -0.006959 -0.023021 -0.019999 0.154817
polarizability: 3.19719565e+02 -7.93037932e+01 3.30185500e+02 5.45430670e+01 2.17285390e+01 1.84463028e+02
1716.lowfreq: -5.7720 -4.8873 -2.9618 0.0011 0.0014 0.0018 7.0662 8.5015 22.0037
frequency: 6.4200 8.4831 21.9614 27.2679 48.0178 57.4333 72.8891 78.9816 98.1996 115.1599 120.6389 142.1710 159.5262 188.8244 210.2687 229.7707 239.2568 254.2547 267.6034 277.8889 285.4749 310.8752 325.5765 383.6392 384.6059 412.2544 428.7783 434.5809 468.3956 498.0887 514.4305 534.4716 541.2514 571.7506 586.3455 601.3458 619.7429 636.7428 639.5551 663.1082 689.7263 719.7455 735.2626 748.3588 767.0562 773.8091 784.6939 825.8211 833.8684 847.7127 866.7628 869.7335 871.5517 888.9770 921.7371 941.6165 951.9839 959.5363 966.0565 988.4967 1010.3432 1020.5668 1032.5484 1049.5060 1053.1538 1081.7376 1111.3456 1113.9280 1120.7051 1128.5474 1143.6464 1158.4083 1168.5531 1172.8285 1182.9051 1207.1067 1215.9397 1228.8309 1252.7896 1263.1442 1276.6577 1282.2087 1291.0121 1294.4504 1305.6689 1339.2295 1344.7961 1358.6796 1382.0081 1395.4577 1427.4361 1434.1607 1436.5462 1439.2442 1440.6399 1450.5153 1458.5464 1468.6486 1469.5350 1474.7158 1478.1011 1483.3083 1507.3777 1522.2728 1548.7465 1554.0953 1614.4350 1636.1377 2960.4551 2961.6876 2981.1676 2996.9552 3002.1483 3035.9581 3050.5053 3050.6551 3060.9678 3076.2066 3081.5960 3125.7362 3129.0096 3129.5396 3134.7607 3144.7593 3150.2902 3163.7543 3172.2311 3172.6930 3533.6031
redmass: 6.6920 6.8427 4.4091 8.7933 4.7577 4.5207 5.8299 3.7109 4.1351 4.0941 2.6042 4.5475 4.3364 3.6085 3.1779 2.1942 1.5036 3.2053 3.3461 3.4662 3.4932 4.6813 4.1007 4.6234 3.7795 3.2920 4.5378 3.6214 2.5858 4.0046 3.5887 2.6087 3.0544 4.3191 3.0789 5.6075 4.8753 3.6038 5.5516 5.1193 5.5751 3.6334 2.9278 6.1570 1.4035 1.3024 2.2729 1.8066 4.1839 2.1433 2.3064 1.7761 2.8370 2.0743 1.9685 1.6716 3.4794 1.3490 1.3416 1.3171 3.5227 2.0711 3.8313 2.1763 1.6808 2.5816 1.2554 1.9657 1.0507 1.8572 1.6267 1.2653 1.4683 1.4003 1.2607 2.2723 1.5526 1.2746 2.7024 1.2711 1.6406 1.3382 2.3080 1.2683 1.2308 1.8490 1.5733 1.4024 3.2852 4.0233 2.1075 1.0882 1.6683 2.7653 1.1000 2.1243 1.1256 1.5012 1.0577 1.0819 1.2412 1.4610 3.0791 6.3893 7.5362 3.4047 5.8066 6.8282 1.0660 1.0336 1.0630 1.0595 1.0564 1.0994 1.1041 1.0583 1.0968 1.1063 1.1039 1.0994 1.0855 1.0898 1.1103 1.0893 1.0868 1.0949 1.0973 1.0983 1.0746
irintensity: 0.3060 0.5473 6.0044 0.4029 0.0818 3.8851 0.1757 5.8392 1.6890 1.1747 0.0943 0.9436 3.6584 4.4402 2.7141 1.5410 1.2249 1.3817 1.0492 3.5828 0.3501 1.5445 0.8012 5.3681 3.9947 3.1966 4.9692 3.7415 13.8645 6.7850 18.2656 32.4404 25.5666 14.3457 38.7913 15.1731 21.2540 10.6821 5.0317 5.6018 8.8606 1.7156 8.3476 15.2396 94.4894 5.4698 1.9767 49.4863 7.5333 24.9666 2.3928 20.8556 1.8880 4.6318 3.2946 4.6509 16.3171 1.8036 0.6832 0.4573 54.5150 14.4758 2.0081 10.8287 1.0146 4.0469 0.1727 5.8718 3.0114 62.9031 37.0106 15.8970 30.5646 8.7666 7.9997 168.8699 26.7514 11.9375 23.6988 43.3407 6.9376 4.0256 13.3590 23.6037 11.0013 13.7322 5.0824 22.2334 46.5252 32.9942 26.3498 16.4334 28.3275 3.1061 6.2517 39.8795 14.7089 101.7213 13.6701 59.0668 4.7784 36.6084 210.7541 72.0230 52.1122 74.1824 8.3612 96.1085 70.2747 78.6435 31.9970 20.2245 23.1778 16.1282 44.8932 25.2943 14.3694 43.5830 0.6813 24.3062 3.6615 14.0822 9.1985 11.9865 2.7862 21.8417 31.6547 18.9161 17.1084
temp: 298.150 k
press: 1.00000 atm
elementType: 17 16 8 7 7 6 6 6 6 6 6 6 6 6 6 6 6 6 6 6 6 6 6 6 1 1 1 1 1 1 1 1 1 1 1 1 1 1 1 1 1 1 1 1 1
symmnumber: 1
zpe: 941248.0 jmol-1
zpe.correction: 0.358502 hartree
zpe.thermalcorrener: 0.382061 hartree
zpe.thermalcorrenthalpy: 0.383005 hartree
zpe.thermalcorrgfe: 0.299809 hartree
zpe.sumelectzpe: -1777.712918 hartree
zpe.sumelectthermal: -1777.689360 hartree
zpe.sumelectthermalent: -1777.688416 hartree
zpe.sumelectthermalfe: -1777.771612 hartree
dipole: -0.3795 -0.0520 0.6629
dipole: 0.7656
quadrupole: -186.5631 -128.3561 -151.6722
quadrupole: -11.2107 -11.2885 1.8727
quadrupole: -31.0326 27.1743 3.8583 -11.2107 -11.2885 1.8727
hfenergy: -1778.0714206 hartree
pointgroup: C01 [X(C19H21Cl1N2O1S1)]
dipole: 0.1472748 0.0057067 0.2627007 debye
polarizability: 292.5377435|-74.5396221|357.0945056|-52.5862693|-20.9393954|184.7358449 unknown
InChI: InChI=1S/C19H21ClN2OS/c1-23-14-7-8-18-16(13-14)19(21-10-4-11-24-12-9-20)15-5-2-3-6-17(15)22-18/h2-3,5-8,13,21H,4,9-12H2,1H3
charge 0 multiplicity 1
45 atoms
Cl 7.17796 -0.975814 0.581391
S  4.559186 1.179427 -0.216445
O  0.828485 -3.863305 -0.851381
N  -0.015197 1.115728 -1.579164
N  -3.009578 -0.280983 1.180094
C  -1.020423 0.679407 -0.713933
C  -1.045731 -0.707701 -0.306371
C  -2.051984 1.551839 -0.223941
C  0.712869 2.400991 -1.519555
C  2.243777 2.172959 -1.461091
C  -2.079894 -1.127336 0.629872
C  -2.99513 1.022885 0.760351
C  -0.089541 -1.675227 -0.753309
C  2.68983 1.491711 -0.155809
C  -2.252645 2.897948 -0.697425
C  -2.120242 -2.506591 1.030171
C  -3.99899 1.902356 1.303057
C  -0.164478 -3.009335 -0.340865
C  -1.199058 -3.436801 0.559351
C  -3.258725 3.707368 -0.175644
C  -4.124601 3.214151 0.858593
C  4.676081 0.105361 1.339951
C  6.112279 -0.02829 1.822263
C  0.791538 -5.273775 -0.456593
H  0.384795 2.951907 -0.621067
H  0.48035 3.0330 -2.401338
H  0.48031 0.383645 -2.091207
H  2.565557 1.563746 -2.330378
H  2.745749 3.154585 -1.563614
H  0.736696 -1.420096 -1.426424
H  2.187607 0.516869 -0.023641
H  2.466135 2.129663 0.718207
H  -1.638791 3.279006 -1.517869
H  -2.915231 -2.792739 1.72548
H  -4.667024 1.477918 2.05896
H  -1.264077 -4.479829 0.882736
H  -3.403262 4.720287 -0.567245
H  -4.901114 3.866382 1.273507
H  4.089608 0.60684 2.13398
H  4.228706 -0.880715 1.130263
H  6.16739 -0.616563 2.751506
H  6.604604 0.947283 1.950372
H  -0.147174 -5.761168 -0.784008
H  0.910602 -5.3920 0.637925
H  1.646274 -5.735393 -0.972316
