program: Gaussian 09
title: 000035233
version: EM64L-G09RevD.01
frameworkgroup: C1[X(C10H19N5)]
method: RPBEPBE
basis: SDD
operation: Freq
keyword: #pfreq=noraman
keyword: PBEPBE/SDD
title: #p freq=noraman PBEPBE/SDD
converged: YES YES NO NO
title: Mulliken charges:
elementType: N N N N N C C C C C C C C C C H H H H H H H H H H H H H H H H H H H
charge: -0.122894 -0.154311 -0.129845 -0.116111 -0.141612 -0.353657 -0.350774 0.113035 -0.666006 -0.667720 0.137642 0.058385 -0.628964 -0.629885 -0.752562 0.259346 0.203166 0.245809 0.206326 0.205931 0.247968 0.212238 0.210331 0.246267 0.210851 0.216710 0.294657 0.215947 0.218843 0.218814 0.283342 0.234882 0.234799 0.239052
chargesum: 0.00000
title: Mulliken charges with hydrogens summed into heavy atoms:
elementType: N N N N N C C C C C C C C C C
charge: -0.122894 -0.154311 -0.129845 -0.116111 -0.141612 0.108855 0.101362 0.113035 0.000131 -0.000271 0.137642 0.058385 0.098350 0.091113 -0.043829
polarizability: 2.04698051e+02 -6.22337205e+00 1.63928720e+02 2.00018960e+00 -3.52703760e+00 9.61901075e+01
1716.lowfreq: -21.4868 -0.0012 -0.0012 -0.0009 1.6780 7.8496 12.2681 47.7416 52.8764
frequency: -21.0845 47.6875 52.8223 71.5826 74.8128 100.5548 116.8849 145.1662 157.3665 169.4513 180.6979 203.7417 213.9508 220.4288 250.0901 265.9235 300.9338 325.8119 342.8844 393.7816 422.2081 504.0939 521.7475 548.4991 575.8000 606.8092 611.5670 711.3601 766.7011 777.2344 793.5239 809.1824 878.7775 900.1268 935.1249 967.9384 999.3304 1030.5893 1050.2862 1055.1100 1069.8158 1075.3002 1082.8628 1098.1572 1099.6918 1150.0277 1184.8164 1192.5186 1223.2914 1240.8699 1267.0704 1304.8011 1308.2039 1348.0111 1354.7384 1362.3955 1380.9031 1383.6192 1390.5473 1410.5623 1410.6215 1431.7464 1446.2347 1453.8697 1455.0745 1460.1513 1466.2405 1467.3671 1469.7034 1470.1477 1481.6644 1483.1313 1484.8492 1491.6736 1492.8531 1540.9631 1581.9420 2955.9442 2962.1974 2981.3304 2982.6435 2995.5053 2999.0562 3005.1635 3026.8298 3028.9323 3066.6855 3068.4626 3082.4005 3082.9924 3086.4684 3099.1963 3101.4247 3124.3229 3125.0566 3129.1664
redmass: 1.0177 3.1483 2.7105 2.6701 3.0859 2.9582 1.7873 1.1069 2.1749 1.7434 5.4375 5.6142 1.8915 1.0592 1.4591 2.9936 3.0926 2.5635 2.2849 2.5806 3.3925 3.4114 4.3501 3.3912 4.6463 3.9745 4.2122 11.1946 1.6435 1.2107 7.3895 2.0666 3.7488 10.6992 2.1356 2.5219 2.2475 2.5511 1.6338 1.3752 2.1593 2.0292 1.8246 1.7653 1.2177 1.3674 3.0733 2.9603 2.8894 4.6026 3.5767 1.3803 1.5748 1.2715 3.0501 1.3236 1.2170 1.2196 1.4934 1.1423 1.3168 1.8286 1.9142 1.1018 1.1640 1.2539 1.1980 1.1700 1.1808 1.0723 1.0493 1.0549 1.0543 1.8913 1.0519 3.0092 4.0009 1.0368 1.0373 1.0357 1.0356 1.0388 1.0644 1.0642 1.1009 1.1014 1.0994 1.0990 1.0982 1.0941 1.0970 1.1020 1.1022 1.0961 1.0957 1.1009
irintensity: 0.3358 0.4555 0.1466 0.0056 1.5881 3.9511 0.7998 0.2416 1.7942 1.4986 0.3584 0.7340 0.3929 0.5911 0.3681 4.0346 0.3827 0.9628 0.9506 13.5506 7.7813 3.5654 0.2691 2.2785 11.7288 4.0085 6.1890 0.2665 20.0059 4.2395 13.2457 6.9717 15.3335 9.4840 19.4352 0.0693 46.7733 21.9359 7.5878 7.1212 24.6061 9.2197 53.8697 10.8148 0.0503 0.0968 56.9284 72.0867 53.3924 3.1831 3.5130 5.9492 63.1168 2.1503 6.4795 48.7225 9.9127 30.9456 27.2367 42.8095 70.8517 46.6601 199.4002 58.1602 128.7973 116.8589 62.4167 41.2042 128.8817 1.7399 4.3395 6.7005 18.1964 154.8714 29.2594 1112.6728 143.4078 32.2753 210.6068 31.5773 31.8833 11.4828 34.2099 66.7070 81.9249 3.0732 9.3943 14.3072 42.0989 17.5321 33.1166 17.2393 44.7782 1.6635 2.0170 13.6047
temp: 298.150 k
press: 1.00000 atm
elementType: 7 7 7 7 7 6 6 6 6 6 6 6 6 6 6 1 1 1 1 1 1 1 1 1 1 1 1 1 1 1 1 1 1 1
symmnumber: 1
zpe: 759753.1 jmol-1
zpe.correction: 0.289375 hartree
zpe.thermalcorrener: 0.306002 hartree
zpe.thermalcorrenthalpy: 0.306947 hartree
zpe.thermalcorrgfe: 0.245110 hartree
zpe.sumelectzpe: -665.062565 hartree
zpe.sumelectthermal: -665.045937 hartree
zpe.sumelectthermalent: -665.044993 hartree
zpe.sumelectthermalfe: -665.106829 hartree
dipole: -0.3480 -2.1038 0.3466
dipole: 2.1604
quadrupole: -78.8662 -87.2378 -92.6070
quadrupole: -2.2284 0.8831 -0.7781
quadrupole: 7.3708 -1.0008 -6.3700 -2.2284 0.8831 -0.7781
hfenergy: -665.3519393 hartree
pointgroup: C01 [X(C10H19N5)]
dipole: 0.1327677 0.8263948 0.1478561 debye
polarizability: 204.7225909|-5.8518335|163.7165353|-3.331871|4.6363512|96.377753 unknown
InChI: InChI=1S/C10H19N5/c1-6-15(7-2)10-12-8(3)11-9(13-10)14(4)5/h6-7H2,1-5H3
charge 0 multiplicity 1
34 atoms
N  1.955716 0.44485 -0.020994
N  -0.379443 0.730558 0.112306
N  -2.728381 0.907101 0.255184
N  0.60485 -1.475705 -0.260258
N  -1.806933 -1.236239 -0.123531
C  3.156188 -0.396098 -0.227961
C  2.141054 1.890909 0.225343
C  0.696207 -0.107786 -0.055734
C  3.724219 -0.957074 1.093379
C  2.121623 2.725148 -1.074206
C  -1.607597 0.12086 0.080436
C  -0.667773 -1.96934 -0.287724
C  -4.080021 0.332889 0.227449
C  -2.623865 2.35418 0.475841
C  -0.821991 -3.456256 -0.491926
H  2.876864 -1.230914 -0.890416
H  3.914222 0.223412 -0.744364
H  1.334632 2.231861 0.895482
H  3.105809 2.019246 0.751902
H  3.979675 -0.147583 1.802076
H  2.980889 -1.619286 1.568925
H  4.640872 -1.544588 0.899334
H  2.902877 2.388263 -1.779931
H  1.139565 2.630526 -1.568067
H  2.299565 3.793419 -0.849769
H  -4.593632 0.503719 1.1943
H  -3.996961 -0.747181 0.04168
H  -4.682422 0.802732 -0.574967
H  -3.071412 2.630628 1.451004
H  -3.159484 2.906875 -0.321268
H  -1.561888 2.637024 0.465698
H  -0.13445 -3.807904 -1.279146
H  -0.557157 -3.994044 0.437667
H  -1.86282 -3.698404 -0.754443
