program: Gaussian 09
title: 000037461
version: EM64L-G09RevD.01
frameworkgroup: C1[X(C25H31NO)]
method: RPBEPBE
basis: SDD
operation: Freq
keyword: #p
keyword: freq=noraman
keyword: PBEPBE/SDD
title: #p freq=noraman PBEPBE/SDD
converged: NO YES NO NO
title: Mulliken charges:
elementType: O N C C C C C C C C C C C C C C C C C C C C C C C C C H H H H H H H H H H H H H H H H H H H H H H H H H H H H H H H
charge: -0.478374 -0.098087 0.339549 -0.162839 -0.578941 0.327752 -0.538881 -0.395924 -0.501675 -0.285583 0.296715 0.033187 -0.794321 -0.771809 -0.763133 0.338627 0.320875 -0.397756 -0.536528 0.315201 -0.622517 -0.392583 -0.298159 -0.397953 -0.438658 -0.272153 -0.240892 0.235362 0.234574 0.230350 0.233404 0.195748 0.182120 0.209671 0.233577 0.184509 0.230217 0.217101 0.225919 0.218335 0.223977 0.243830 0.205430 0.218297 0.214794 0.225251 0.331066 0.236363 0.221169 0.233264 0.213982 0.215772 0.232745 0.224857 0.240747 0.234970 0.223016 0.224445
chargesum: 0.00000
title: Mulliken charges with hydrogens summed into heavy atoms:
elementType: O N C C C C C C C C C C C C C C C C C C C C C C C C C
charge: -0.147308 -0.098087 0.339549 0.072523 -0.114017 0.327752 -0.109729 -0.004134 -0.083589 -0.055365 0.296715 0.033187 -0.132967 -0.098572 -0.104791 0.338627 0.320875 -0.161393 -0.082095 0.315201 -0.192763 -0.159838 -0.073302 -0.157206 -0.203687 -0.049138 -0.016447
polarizability: 3.48004982e+02 5.19433927e+00 2.68321439e+02 -1.47510116e+01 9.93798023e+00 1.99102204e+02
1716.lowfreq: -3.1448 -0.0006 -0.0004 0.0003 2.5067 10.9765 24.6471 38.5396 45.6676
frequency: 24.4075 38.3585 45.5378 78.2583 88.5414 106.6925 118.0242 139.1762 166.1630 177.9660 198.2923 216.1249 235.9840 244.0548 254.5723 272.5880 275.2147 287.2946 293.7188 303.9658 320.8815 324.0621 340.5399 347.2670 350.2814 371.9617 393.7647 399.1083 407.9211 447.3532 453.4492 457.5999 467.1150 471.0586 502.7763 516.6213 520.2223 526.3667 538.9136 575.6073 580.6048 600.4180 617.1073 631.6769 662.1274 714.6251 734.4315 745.4437 760.4136 769.0688 787.7612 796.5896 806.2240 811.3263 839.6033 856.6301 872.5294 891.8870 899.9552 923.6775 924.4735 928.9116 938.7547 940.3683 951.6958 957.9741 960.9346 973.6865 984.3810 986.6056 1006.6407 1011.2712 1019.2155 1035.8588 1042.7308 1048.9022 1062.6226 1072.1018 1095.7992 1102.7876 1107.5206 1112.6682 1136.4147 1159.7825 1166.7431 1172.7147 1176.1053 1177.2252 1183.6788 1194.1307 1212.8574 1217.0442 1220.7553 1232.5864 1234.0226 1234.9411 1238.8761 1245.4490 1252.7100 1258.3527 1275.4354 1293.4276 1299.1698 1305.0409 1321.6333 1328.0623 1332.6459 1339.8109 1348.7557 1355.1232 1356.9756 1370.4273 1371.2479 1377.3861 1382.5747 1394.6395 1400.8073 1429.7206 1436.7496 1441.1216 1442.4598 1450.0825 1459.3999 1463.2972 1467.1823 1469.1133 1474.0119 1480.6639 1485.9509 1486.2122 1490.8320 1491.6541 1499.1182 1588.7142 1592.7351 1598.9067 1612.5035 2844.6687 2851.7688 2865.0397 2949.6110 2961.4420 2970.9064 2975.1085 2979.5278 2984.3719 2986.7943 3011.7764 3021.8668 3023.3006 3033.0365 3045.0548 3058.4349 3063.1505 3064.1612 3067.3084 3073.2670 3079.9157 3085.3177 3098.5394 3108.7974 3114.0225 3125.9056 3128.3686 3149.0596 3152.2809 3164.8454 3554.7305
redmass: 4.0044 3.5787 3.3229 3.3266 3.7668 3.7836 3.2965 3.9001 4.4285 3.2348 3.3399 1.1254 1.2290 2.6701 2.0379 2.8295 1.7726 1.8443 3.1746 1.6689 2.5248 2.2433 2.7655 3.7427 1.9240 2.1437 2.5490 3.2585 3.3873 3.3834 3.3114 3.1705 2.7309 2.9661 3.2913 3.1298 3.4395 4.0319 3.3519 2.7650 3.9394 3.1112 3.8299 4.6972 4.2815 3.3851 3.2139 2.3242 1.4918 3.1969 1.7929 2.5418 3.2957 2.8851 2.4452 2.7256 1.4384 2.4250 1.8344 1.6858 2.1271 1.7262 1.5039 1.3166 2.1998 2.0705 2.1619 1.4169 1.4012 1.8579 1.6557 1.9898 1.6076 2.0704 2.9430 2.2559 2.3748 2.3621 2.1544 2.4268 1.9921 2.8900 2.2518 1.6513 1.3161 1.1884 1.6787 1.4687 1.5960 1.4723 1.3944 2.5043 2.1349 1.5566 1.7376 1.9370 2.0852 1.8680 2.0259 1.6435 1.6780 1.3741 1.3406 1.3890 1.4366 1.5721 1.6296 1.5685 1.9508 1.6281 1.5622 1.2473 2.1762 1.2130 5.7723 1.4439 1.2022 1.1289 2.0903 1.9723 1.1900 1.8303 1.4436 1.0971 1.0520 1.0541 1.0519 1.3054 1.1288 1.0533 1.5515 1.1920 1.0584 6.9250 6.8113 5.9285 6.3470 1.0786 1.0699 1.0692 1.0805 1.0598 1.0358 1.0351 1.0367 1.0655 1.0617 1.0962 1.0783 1.0713 1.0892 1.1006 1.0988 1.0987 1.0994 1.0979 1.0975 1.0990 1.0998 1.0999 1.0873 1.0866 1.0891 1.0889 1.0946 1.0992 1.0975 1.0655
irintensity: 0.0131 0.2589 0.0629 0.7708 0.3892 0.9230 1.0367 0.3652 0.8346 0.2521 1.3162 6.2700 1.5140 0.7191 2.2994 2.1295 17.5439 24.9025 16.8242 45.7078 4.4937 19.6907 4.6413 0.4014 20.9528 5.7275 2.6227 1.6681 2.0500 1.6959 4.8766 0.5192 0.5990 11.8621 5.5989 1.9866 1.0721 2.2988 2.1221 7.5844 2.7648 4.7542 3.7019 9.6988 8.6352 4.2103 9.6768 18.5643 40.9640 10.0408 17.7797 21.0188 4.9523 12.9253 6.1259 5.1996 0.2850 3.5376 10.1471 1.2271 9.2964 2.5145 3.3606 0.4839 4.6650 1.3401 6.3017 0.1488 0.7035 0.7977 4.5719 11.0192 8.6504 4.2360 6.2722 7.8015 34.1494 25.3164 27.0454 0.8948 8.9897 18.0012 22.3544 16.0977 7.1902 2.0992 8.5938 2.8942 1.2733 2.1736 0.5981 5.9515 22.9984 3.6999 8.6574 11.0975 8.8407 0.4168 8.3908 6.0274 10.9121 9.0739 4.6243 6.6300 6.2892 3.0812 16.1131 5.3994 40.3736 17.1365 7.5573 23.8899 4.8637 27.9498 0.1140 2.3272 22.0523 1.9621 10.3803 9.9728 7.3217 19.6778 10.0781 5.3506 0.9188 0.5609 1.7249 24.1167 18.9043 9.5552 12.9916 8.5201 32.9134 6.8284 2.9161 4.9354 2.9036 19.0635 45.2908 141.4439 14.6276 29.9502 30.3141 26.4524 19.8498 21.7611 55.0083 43.6341 31.8388 12.2162 47.2939 37.4284 17.4688 24.1216 9.2762 32.0372 93.9989 44.3199 29.0170 13.6271 8.9618 7.6372 21.0675 12.2949 42.0200 33.9752 22.7337 3.8591
temp: 298.150 k
press: 1.00000 atm
elementType: 8 7 6 6 6 6 6 6 6 6 6 6 6 6 6 6 6 6 6 6 6 6 6 6 6 6 6 1 1 1 1 1 1 1 1 1 1 1 1 1 1 1 1 1 1 1 1 1 1 1 1 1 1 1 1 1 1 1
symmnumber: 1
zpe: 1309230.1 jmol-1
zpe.correction: 0.498659 hartree
zpe.thermalcorrener: 0.522584 hartree
zpe.thermalcorrenthalpy: 0.523529 hartree
zpe.thermalcorrgfe: 0.447283 hartree
zpe.sumelectzpe: -1099.237126 hartree
zpe.sumelectthermal: -1099.213202 hartree
zpe.sumelectthermalent: -1099.212257 hartree
zpe.sumelectthermalfe: -1099.288502 hartree
dipole: 1.2287 -1.0487 1.0870
dipole: 1.9471
quadrupole: -147.0638 -153.4198 -164.7990
quadrupole: -7.4415 -1.1798 4.6444
quadrupole: 8.0304 1.6744 -9.7048 -7.4415 -1.1798 4.6444
hfenergy: -1099.7357859 hartree
pointgroup: C01 [X(C25H31N1O1)]
dipole: -0.4794375 -0.4128194 -0.4318948 debye
polarizability: 348.1348743|-4.4492725|268.4043769|-14.4282975|-9.4999166|198.8893738 unknown
InChI: InChI=1S/C25H31NO/c1-24(2,3)25(27)13-14-26-16-21-19-9-5-4-7-17(19)11-12-18-8-6-10-20(23(18)21)22(26)15-25/h4-10,21-22,27H,11-16H2,1-3H3
charge 0 multiplicity 1
58 atoms
O  -3.927436 -0.819792 1.565757
N  -0.837424 -1.202242 -0.11845
C  -3.710401 -0.581296 0.10486
C  -1.261804 -0.011999 0.659188
C  -2.607254 0.503204 0.081704
C  -5.075402 -0.086561 -0.542976
C  -3.173539 -1.885701 -0.54227
C  -1.810666 -2.303918 0.043007
C  0.542979 -1.5708 0.227785
C  1.519036 -0.539845 -0.378603
C  -0.182768 1.07839 0.648216
C  1.107178 0.89402 0.050242
C  -6.215781 -1.101755 -0.239718
C  -5.489657 1.281491 0.067316
C  -4.954955 0.066118 -2.085227
C  2.983129 -0.919453 -0.093117
C  1.959158 2.036196 -0.096585
C  -0.519391 2.318071 1.244162
C  3.273154 2.100225 -0.890098
C  4.020597 -0.29132 -0.841193
C  3.67388 0.873918 -1.743218
C  1.574112 3.270722 0.487679
C  0.365496 3.410001 1.192714
C  3.341368 -1.935416 0.82978
C  5.365866 -0.690624 -0.662562
C  4.688442 -2.324154 1.011553
C  5.708827 -1.705754 0.257985
H  -1.458726 -0.307799 1.722458
H  -2.954992 1.361042 0.67774
H  -2.430963 0.846517 -0.952793
H  -3.04255 -1.72888 -1.62741
H  -3.898068 -2.713294 -0.405952
H  -1.93258 -2.589411 1.119087
H  -1.433254 -3.190168 -0.500732
H  0.765528 -2.569535 -0.190766
H  0.677449 -1.6305 1.337499
H  1.37344 -0.613789 -1.477477
H  -6.455492 -1.1343 0.839839
H  -7.137609 -0.789752 -0.76389
H  -5.977328 -2.125174 -0.583833
H  -4.847607 2.1054 -0.292235
H  -5.433367 1.247671 1.169982
H  -6.529951 1.523445 -0.221145
H  -4.858771 -0.909717 -2.59423
H  -5.865721 0.555376 -2.478968
H  -4.091751 0.69253 -2.373686
H  -4.492727 -1.627064 1.66898
H  -1.483354 2.4278 1.753422
H  3.200988 2.981925 -1.5586
H  4.10507 2.315986 -0.188927
H  4.546587 1.145212 -2.365721
H  2.849768 0.621294 -2.438513
H  2.244733 4.133198 0.381765
H  0.103386 4.361934 1.667156
H  2.572306 -2.43987 1.421397
H  6.150479 -0.196751 -1.249255
H  4.93502 -3.109617 1.734993
H  6.754613 -2.007238 0.385586
