program: Gaussian 09
title: 000037396
version: EM64L-G09RevD.01
frameworkgroup: C1[X(C21H26ClNO3)]
method: RPBEPBE
basis: SDD
operation: Freq
keyword: #p
keyword: freq=noraman
keyword: PBEPBE/SDD
title: #p freq=noraman PBEPBE/SDD
converged: YES YES NO NO
title: Mulliken charges:
elementType: Cl O O O N C C C C C C C C C C C C C C C C C C C C C H H H H H H H H H H H H H H H H H H H H H H H H H H
charge: -0.098637 -0.253526 -0.472649 -0.266884 -0.115225 -0.351880 -0.353908 -0.112005 -0.315588 -0.287458 -0.367239 0.359509 0.421596 0.211732 -0.567304 -0.664325 -0.373313 -0.379869 -0.394807 -0.386003 -0.224761 -0.248076 -0.240008 -0.236711 -0.240377 -0.232494 0.231298 0.198487 0.199197 0.201676 0.223306 0.227924 0.218913 0.249282 0.202183 0.195379 0.279002 0.282539 0.206138 0.219330 0.233664 0.282426 0.254598 0.265853 0.275890 0.370598 0.227674 0.227273 0.224768 0.229916 0.229037 0.233861
chargesum: 0.00000
title: Mulliken charges with hydrogens summed into heavy atoms:
elementType: Cl O O O N C C C C C C C C C C C C C C C C C C C C C
charge: -0.098637 -0.253526 -0.102051 -0.266884 -0.115225 0.077905 0.046965 -0.112005 0.135641 0.180737 0.030323 0.359509 0.421596 0.211732 -0.005764 -0.005193 -0.090886 -0.125271 -0.128953 -0.110113 0.002913 -0.020804 -0.015240 -0.006796 -0.011340 0.001367
polarizability: 2.73119468e+02 1.63097486e+01 2.31463626e+02 1.37400176e+01 -6.24220136e-02 2.27164341e+02
1716.lowfreq: -13.4745 -9.2822 0.0014 0.0021 0.0022 3.8807 10.9156 20.4239 27.2515
frequency: 6.3611 17.8141 26.8757 32.1309 40.7932 46.9074 57.1857 59.4382 66.0845 79.8303 82.9150 96.2480 113.5963 133.5795 181.3399 198.1432 212.9862 219.9347 232.1069 247.7637 264.9706 278.5129 289.5974 303.3971 322.7009 337.7785 356.4494 372.9519 382.0035 397.0257 403.1321 406.2910 463.4966 471.3804 491.9513 513.0866 528.1243 557.3943 595.5887 615.8069 617.1506 645.9867 663.0017 690.8004 703.0335 709.6768 728.9903 740.2976 763.4672 763.9386 776.7870 802.3365 808.7361 857.9021 862.8890 864.9571 892.2811 900.4955 913.2517 939.6037 944.2742 951.9774 965.8473 982.9083 986.7505 990.2404 990.7125 998.1302 1000.3556 1004.7149 1013.6945 1025.7215 1028.9797 1031.2894 1065.1512 1078.5042 1082.6307 1093.2208 1096.2491 1098.5882 1119.7113 1141.4450 1170.2579 1172.3506 1173.4315 1183.0597 1185.9068 1192.4073 1195.9211 1213.6416 1246.0312 1251.2325 1258.2556 1272.4901 1287.1754 1304.1005 1312.2023 1316.8016 1343.4274 1344.9877 1353.7646 1359.6228 1367.7697 1379.0438 1380.7073 1382.8488 1393.8342 1431.7075 1435.3634 1445.3678 1457.9642 1461.1047 1465.3923 1470.5100 1476.6529 1478.0472 1481.2426 1485.9282 1490.6487 1589.5070 1591.5958 1599.7906 1606.1973 1613.4080 2848.2184 2862.3540 2931.0724 2978.8014 2985.6151 3013.6181 3024.7125 3032.9379 3043.6270 3059.3587 3073.0189 3078.8890 3088.0509 3098.2449 3123.8437 3126.9401 3135.1598 3135.4543 3150.4786 3154.9428 3160.8090 3161.1870 3164.9465 3174.0654 3174.7461 3452.7866
redmass: 6.2241 4.4537 6.3971 4.3886 4.2645 4.1219 4.4551 4.3429 4.6288 2.7139 5.0157 3.2136 5.7450 2.9404 4.1379 1.5803 5.3521 3.2411 3.3922 2.6944 3.7647 5.0655 3.2770 2.2946 4.3844 4.5515 4.1553 5.0333 2.3472 2.3351 2.8601 2.9195 1.7937 2.0967 2.4515 3.4666 3.1251 5.7988 6.2297 6.3732 6.4224 5.8310 5.9880 6.9857 1.8876 1.8747 2.0455 3.0791 1.7756 1.1510 2.4308 1.8570 3.0684 1.2491 1.2625 2.2951 1.5087 3.3212 2.2324 1.7173 1.7685 2.0358 2.6520 1.4050 1.5555 4.4494 4.8442 1.3557 1.3222 1.6336 3.5255 2.2183 2.1761 2.1756 2.6046 2.1133 1.5925 2.5254 1.7491 2.0413 1.6099 2.9292 1.6507 1.0865 1.5528 1.5940 2.2266 1.1594 1.9109 1.7330 1.1597 1.2652 1.1801 1.1971 1.2765 1.3681 1.3404 1.3426 1.3983 1.3907 1.4279 1.3462 1.3167 8.4669 8.6000 1.3634 1.2249 2.1905 2.2275 1.0936 1.0928 1.0975 1.0815 1.0621 2.1585 2.1758 1.0836 1.0693 1.0705 6.2405 6.2875 7.8979 6.0470 6.5074 1.0709 1.0706 1.0698 1.0566 1.0396 1.0917 1.0591 1.0957 1.0877 1.0913 1.0582 1.0998 1.0995 1.1065 1.0848 1.0851 1.0891 1.0893 1.0932 1.0932 1.1113 1.0972 1.0964 1.0969 1.0973 1.0646
irintensity: 0.3261 0.4666 0.2813 0.0586 0.3638 0.0170 0.1594 0.6362 0.1833 1.7724 0.0857 0.8706 0.9372 0.4470 2.7057 1.1566 3.4639 0.2941 1.5616 1.9256 0.2812 1.1222 0.3872 0.6004 6.4806 48.7038 0.3157 35.6279 2.2760 6.8579 0.3840 0.6065 48.3215 78.4897 3.4317 2.9456 18.3395 1.5914 38.1299 0.5112 0.1128 72.6096 23.5750 9.6015 55.6080 48.0892 12.8561 51.0056 44.1538 6.9102 12.4641 15.8682 8.5103 0.9997 0.1061 0.7203 4.2082 10.6246 12.9269 1.8030 6.8947 9.0916 46.8405 0.9210 0.3083 1.1388 1.3634 2.8444 0.1201 3.8463 56.0063 45.0426 9.8424 9.7257 8.4606 18.5230 0.1327 6.7333 6.9419 14.8687 11.6521 172.4894 71.2731 6.0826 55.3159 11.4772 32.5605 0.4146 11.6754 12.5074 18.3453 26.9491 3.1005 0.4511 14.6650 11.4924 0.1759 0.9859 20.3896 33.3479 7.4255 2.0787 4.5227 0.1252 0.9784 7.9005 12.2032 5.3594 22.7102 17.7490 5.4415 18.7737 2.0405 1.9124 29.0894 28.3977 21.8014 10.6303 31.6838 2.4775 0.2031 115.0799 8.0840 29.6080 69.0021 151.3350 64.5539 56.8419 14.2780 15.9317 34.1658 45.6194 17.9839 13.0353 13.9650 48.0624 51.8978 12.9813 0.2935 1.2007 7.3706 18.5204 24.7951 15.1637 9.6415 19.2017 16.7880 15.1960 7.7820 48.6919
temp: 298.150 k
press: 1.00000 atm
elementType: 17 8 8 8 7 6 6 6 6 6 6 6 6 6 6 6 6 6 6 6 6 6 6 6 6 6 1 1 1 1 1 1 1 1 1 1 1 1 1 1 1 1 1 1 1 1 1 1 1 1 1 1
symmnumber: 1
zpe: 1116689.7 jmol-1
zpe.correction: 0.425325 hartree
zpe.thermalcorrener: 0.451786 hartree
zpe.thermalcorrenthalpy: 0.452731 hartree
zpe.thermalcorrgfe: 0.364011 hartree
zpe.sumelectzpe: -1554.352059 hartree
zpe.sumelectthermal: -1554.325597 hartree
zpe.sumelectthermalent: -1554.324653 hartree
zpe.sumelectthermalfe: -1554.413373 hartree
dipole: 0.1993 -2.8284 -2.6933
dipole: 3.9107
quadrupole: -158.8028 -163.6978 -153.1896
quadrupole: -11.6520 6.3431 6.8448
quadrupole: -0.2394 -5.1344 5.3738 -11.6520 6.3431 6.8448
hfenergy: -1554.7773836 hartree
pointgroup: C01 [X(C21H26Cl1N1O3)]
dipole: -0.1323187 -1.199109 0.954938 debye
polarizability: 271.480218|-19.2222413|233.011831|12.3053141|-0.1190022|227.2553867 unknown
InChI: InChI=1S/C21H26ClNO3/c1-2-14-23(15-13-22)16-17-26-20(24)21(25,18-9-5-3-6-10-18)19-11-7-4-8-12-19/h3-12,25H,2,13-17H2,1H3
charge 0 multiplicity 1
52 atoms
Cl -4.282546 2.749629 1.12611
O  -0.061701 -1.160457 0.90642
O  1.610997 -0.325372 -2.227112
O  0.321114 -2.333084 -1.070568
N  -3.120224 -1.198426 0.611667
C  -2.323168 -1.635557 1.773694
C  -3.760066 -2.299323 -0.152705
C  1.422042 -0.149173 -0.784505
C  -3.996871 -0.0400 0.90601
C  -0.963797 -2.243111 1.412287
C  -4.082919 -1.937078 -1.621157
C  2.793567 -0.257038 -0.064382
C  0.742072 1.222585 -0.577267
C  0.49664 -1.32572 -0.339823
C  -3.226135 1.253412 0.612861
C  -2.836887 -1.573141 -2.454818
C  3.951175 0.092219 -0.804151
C  0.860796 1.935667 0.639879
C  2.934123 -0.649888 1.290287
C  -0.025626 1.776819 -1.631164
C  5.226082 0.049504 -0.200297
C  0.213772 3.181065 0.803692
C  4.213144 -0.697681 1.891182
C  -0.666409 3.025308 -1.467579
C  5.363569 -0.347034 1.150443
C  -0.554499 3.731343 -0.248137
H  -2.14354 -0.762328 2.426564
H  -2.863629 -2.393806 2.397988
H  -4.693208 -2.652268 0.354741
H  -3.059354 -3.155749 -0.160522
H  -4.354457 -0.036448 1.960096
H  -4.89581 -0.078953 0.267005
H  -0.470318 -2.645419 2.314852
H  -1.030469 -3.029706 0.64225
H  -4.598862 -2.808834 -2.071996
H  -4.811164 -1.102021 -1.6529
H  -3.021033 1.383499 -0.457894
H  -2.29234 1.340978 1.186772
H  -3.114691 -1.338007 -3.498612
H  -2.108122 -2.40419 -2.469782
H  -2.322573 -0.696336 -2.024341
H  3.833732 0.38447 -1.851501
H  1.467391 1.532002 1.45599
H  2.05095 -0.919933 1.87804
H  -0.084188 1.234709 -2.578997
H  1.48654 -1.296355 -2.42125
H  6.111873 0.323913 -0.784314
H  0.314842 3.724399 1.749947
H  4.30799 -1.009082 2.937745
H  -1.250184 3.447727 -2.293367
H  6.354068 -0.384174 1.617685
H  -1.056188 4.696349 -0.119369
