program: Gaussian 09
title: 000037375
version: EM64L-G09RevD.01
frameworkgroup: C1[X(C18H18FNO2)]
method: RPBEPBE
basis: SDD
operation: Freq
keyword: #p
keyword: freq=noraman
keyword: PBEPBE/SDD
title: #p freq=noraman PBEPBE/SDD
converged: YES YES NO NO
title: Mulliken charges:
elementType: F O O N C C C C C C C C C C C C C C C C C C H H H H H H H H H H H H H H H H H H
charge: -0.210231 -0.293904 -0.302120 -0.018935 0.454576 0.243012 -0.584145 0.013167 -0.502182 -0.670864 -0.603808 -0.537426 0.214361 0.180520 0.544527 -0.418273 -0.358451 -0.369462 -0.363797 0.308613 -0.530725 -0.530663 0.230087 0.227902 0.232401 0.224219 0.217695 0.259285 0.262982 0.256201 0.235347 0.259053 0.253567 0.252662 0.224321 0.259927 0.231353 0.229069 0.249007 0.231131
chargesum: 0.00000
title: Mulliken charges with hydrogens summed into heavy atoms:
elementType: F O O N C C C C C C C C C C C C C C C C C C
charge: -0.210231 -0.293904 -0.302120 -0.018935 0.454576 0.243012 -0.126156 0.013167 -0.045561 -0.193884 -0.340826 -0.281225 0.214361 0.180520 0.544527 -0.182926 -0.099398 -0.115895 -0.111135 0.308613 0.184876 0.178544
polarizability: 2.19772192e+02 8.56555971e+00 2.42990471e+02 2.83809990e+00 -1.43507576e+01 1.57286542e+02
1716.lowfreq: -9.5046 -0.0005 -0.0004 0.0004 0.1959 5.3151 18.1575 27.3511 38.2807
frequency: 17.8924 27.0996 38.2653 58.6905 70.0548 100.5483 112.6406 119.3719 137.1580 162.1312 164.7512 185.3891 216.7185 232.6170 259.0292 280.2166 294.9033 312.7558 330.9274 363.5552 381.1462 394.5908 412.9231 414.1141 442.6844 466.1157 495.8362 505.4535 510.7472 542.8427 619.9231 625.5057 645.3433 653.9449 707.5700 709.7788 722.8663 746.0512 747.6039 777.3034 815.4512 821.3396 844.8834 852.8099 891.4050 892.9470 896.0539 908.4520 941.3645 951.3783 966.6288 973.5846 1004.5609 1008.9542 1037.2750 1066.8014 1099.2792 1104.3449 1114.1195 1116.2874 1149.0178 1153.8806 1155.6016 1159.2892 1172.3966 1180.2815 1193.7107 1205.1618 1224.2799 1241.7950 1253.0691 1288.3144 1298.8496 1307.8105 1312.4357 1341.3305 1363.9349 1383.5169 1389.9378 1408.3474 1427.0110 1445.1903 1447.5243 1455.7579 1458.1373 1460.1344 1463.8134 1476.8659 1487.9561 1488.0337 1494.2475 1543.7119 1588.8298 1603.8536 1612.2883 1614.5265 2956.7184 2964.9953 2971.5710 2977.2612 2994.5449 3044.7055 3052.7891 3055.5865 3067.1632 3075.8034 3121.3131 3126.0576 3126.2900 3140.3744 3146.5964 3165.7255 3171.2644 3173.9373
redmass: 5.6368 5.0171 3.9752 3.8076 4.0453 2.9987 3.6221 4.8198 3.5668 1.0903 1.1318 4.0586 4.0490 3.6929 4.5707 3.9488 3.2794 6.6454 4.8228 3.9686 5.4568 3.5288 3.6676 3.0245 3.6484 4.8443 3.6154 4.9213 2.7704 6.0386 5.8447 5.7797 4.2630 3.8241 4.2474 4.4140 5.0864 3.8544 3.2947 3.2305 2.5958 1.3931 2.0751 3.1847 1.6729 2.8344 2.0745 2.1123 1.5563 3.7841 1.4075 2.3033 3.0905 2.9086 2.3241 3.3740 1.8665 1.8502 1.2705 1.2555 1.3677 1.5118 1.4109 1.1728 1.7778 1.3675 1.6252 4.5648 1.2902 1.3807 3.1623 1.3838 1.9154 1.8637 1.5793 1.9530 5.6934 6.8338 2.6181 2.8834 1.1894 1.2371 1.2176 1.1110 1.0554 1.0686 1.1121 1.0555 1.5634 1.6032 2.5464 7.9112 8.2377 7.5095 6.5395 7.0896 1.0698 1.0635 1.0305 1.0312 1.0612 1.0944 1.0951 1.0995 1.1048 1.1036 1.1024 1.0903 1.1033 1.0898 1.0918 1.0908 1.0952 1.0960
irintensity: 0.2787 0.2238 0.0671 1.1586 0.7871 6.5795 4.5997 2.4994 2.1465 0.1444 0.6258 1.7862 3.5408 0.7701 17.9834 6.3183 3.3196 2.3604 0.4110 3.5424 0.5607 4.2166 4.5991 0.2741 3.8253 5.5895 12.1085 8.8874 21.7419 3.5934 8.6250 0.0672 0.9080 23.1721 1.6789 0.0087 15.0761 16.1131 3.9362 49.0230 25.9980 3.9747 30.2448 2.5806 3.9687 4.7272 1.3441 54.5311 15.7016 67.5480 3.4251 10.4273 2.9467 26.3938 13.5302 12.5330 46.0502 46.0149 16.7820 0.3425 6.3270 47.4775 6.4991 0.2918 29.8893 2.2649 30.2258 14.3060 15.2035 1.2195 76.5681 9.7974 105.8553 66.7801 45.7316 14.7163 9.1205 0.9159 10.1344 2.9914 2.0320 12.5731 9.4845 4.9969 14.3197 6.6576 29.3419 7.0028 8.3773 75.1297 117.8732 79.5916 31.5409 10.4579 15.9575 26.0493 31.7953 39.3401 62.0626 81.1947 18.4373 36.9574 44.1152 6.7004 27.8575 22.1788 24.3705 12.7216 21.4139 4.2284 6.1638 3.9824 4.8298 3.0645
temp: 298.150 k
press: 1.00000 atm
elementType: 9 8 8 7 6 6 6 6 6 6 6 6 6 6 6 6 6 6 6 6 6 6 1 1 1 1 1 1 1 1 1 1 1 1 1 1 1 1 1 1
symmnumber: 1
zpe: 830797.6 jmol-1
zpe.correction: 0.316434 hartree
zpe.thermalcorrener: 0.336717 hartree
zpe.thermalcorrenthalpy: 0.337661 hartree
zpe.thermalcorrgfe: 0.265882 hartree
zpe.sumelectzpe: -1000.128413 hartree
zpe.sumelectthermal: -1000.108130 hartree
zpe.sumelectthermalent: -1000.107186 hartree
zpe.sumelectthermalfe: -1000.178965 hartree
dipole: -3.4901 -0.4331 0.2396
dipole: 3.5250
quadrupole: -130.3943 -122.0399 -128.7139
quadrupole: 3.5129 2.6733 -9.7071
quadrupole: -3.3450 5.0095 -1.6645 3.5129 2.6733 -9.7071
hfenergy: -1000.444847 hartree
pointgroup: C01 [X(C18H18F1N1O2)]
dipole: 1.3858031 0.0517939 0.0158692 debye
polarizability: 221.0567073|10.9535046|242.515732|-5.6334775|9.7370553|156.4767656 unknown
InChI: InChI=1S/C18H18FNO2/c1-21-17-10-13-7-8-20-16(15(13)11-18(17)22-2)9-12-3-5-14(19)6-4-12/h3-6,10-11H,7-9H2,1-2H3
charge 0 multiplicity 1
40 atoms
F  -4.705099 2.646886 -1.358235
O  4.155845 0.722276 -1.272619
O  2.590883 2.141524 0.771853
N  -0.732994 -3.040569 0.857985
C  1.431423 -1.719403 -0.596187
C  0.686075 -1.055692 0.426985
C  0.917628 -3.064756 -1.079366
C  -0.505429 -1.750572 0.999907
C  0.270299 -3.835443 0.092636
C  -1.535547 -0.961252 1.805388
C  2.579301 -1.104853 -1.131193
C  1.09758 0.23122 0.85407
C  3.006708 0.163746 -0.677478
C  2.234389 0.852207 0.303761
C  -2.35761 0.012135 0.959483
C  -2.513646 1.367718 1.341796
C  -3.008483 -0.442706 -0.217167
C  -3.298289 2.26034 0.575832
C  -3.795479 0.429255 -0.999456
C  -3.920051 1.765622 -0.58169
C  5.248627 1.086333 -0.337815
C  2.461438 3.208895 -0.249502
H  0.151788 -2.899108 -1.866617
H  1.726219 -3.662646 -1.537495
H  -0.235669 -4.7467 -0.27099
H  1.052795 -4.163457 0.810517
H  -1.039452 -0.41123 2.627514
H  -2.19953 -1.713528 2.26811
H  3.177089 -1.600544 -1.903615
H  0.538977 0.786873 1.612515
H  -2.02328 1.734567 2.251583
H  -2.89753 -1.490633 -0.516813
H  -3.427164 3.307895 0.863265
H  -4.303779 0.090296 -1.907003
H  5.664693 0.171528 0.124436
H  4.888221 1.772944 0.447857
H  6.01326 1.572696 -0.961895
H  1.405057 3.307341 -0.562863
H  3.094285 2.993654 -1.129944
H  2.794351 4.132837 0.247251
