program: Gaussian 09
title: 000040576
version: EM64L-G09RevD.01
frameworkgroup: C1[X(C15H14N2O)]
method: RPBEPBE
basis: SDD
operation: Freq
keyword: #p
keyword: freq=noraman
keyword: PBEPBE/SDD
title: #p freq=noraman PBEPBE/SDD
converged: YES YES NO NO
title: Mulliken charges:
elementType: O N N C C C C C C C C C C C C C C C H H H H H H H H H H H H H H
charge: -0.269626 -0.238362 -0.302400 0.199975 0.229048 0.174917 0.238839 -0.541425 0.508608 -0.363934 -0.392827 -0.458821 -0.372342 -0.648111 -0.556887 -0.256305 -0.224644 -0.045234 0.256225 0.233109 0.237997 0.230221 0.232285 0.241999 0.235761 0.237058 0.228684 0.266422 0.224661 0.222886 0.304444 0.167778
chargesum: 0.00000
title: Mulliken charges with hydrogens summed into heavy atoms:
elementType: O N N C C C C C C C C C C C C C C C
charge: -0.269626 -0.238362 0.002045 0.199975 0.229048 0.174917 0.238839 -0.285201 0.508608 -0.130825 -0.154830 -0.228600 -0.140058 0.066708 -0.061781 -0.031645 -0.001758 0.122545
polarizability: 2.64147505e+02 -1.83724601e+01 2.11127786e+02 6.84891801e+00 1.61490983e+00 9.08023429e+01
1716.lowfreq: -5.1733 -4.0879 -0.0007 -0.0004 -0.0004 4.7420 15.2892 26.0418 58.4704
frequency: 15.2556 26.0245 58.4358 68.7874 114.4941 122.9835 137.5401 169.8589 226.4698 247.8972 272.2448 299.3514 308.1491 360.8387 381.7577 423.2632 443.2440 463.8220 519.5083 553.2866 567.0550 583.6824 603.9607 622.2517 627.7527 688.7283 719.7198 738.3116 753.8869 755.4452 776.9736 808.3424 845.7087 853.5552 881.5627 911.1740 936.2066 939.0222 944.3390 963.9445 973.9575 1006.2500 1014.9839 1022.3473 1053.8437 1116.1191 1123.4733 1128.6159 1153.0294 1166.9408 1183.9056 1187.9930 1225.0718 1239.5404 1255.5499 1299.8649 1326.6485 1346.9948 1357.0910 1365.9379 1403.8771 1406.7463 1434.7864 1441.2665 1466.0184 1467.9365 1475.7696 1477.0584 1483.1657 1493.0811 1496.0887 1582.8476 1591.3231 1614.3865 1636.9252 1642.3156 2930.9175 2973.5122 2985.8628 3045.8042 3062.5547 3097.5592 3120.0183 3127.2410 3133.5000 3136.3036 3149.3170 3150.8660 3165.4238 3538.7558
redmass: 6.7226 5.3494 1.0851 3.6560 4.1342 3.4618 4.0386 4.2944 4.8666 3.5833 2.7318 4.5579 3.4383 3.0773 5.1784 3.1119 3.4696 3.5940 5.2488 4.9106 3.7293 4.0558 1.2077 4.7219 4.8593 4.4991 5.7626 2.3258 1.9550 4.0443 2.9813 1.5101 3.6763 1.4709 4.1305 1.5508 1.3912 1.3746 3.0401 1.6202 1.3118 3.1868 2.3022 2.0877 4.5627 1.3117 1.6856 1.5432 1.4871 1.2068 1.9896 1.9240 1.2059 2.1293 1.9445 1.5253 2.1014 1.5210 3.1610 1.2621 4.8767 3.4471 1.5766 3.2144 1.9153 1.8218 1.6149 1.1341 1.1978 1.8980 2.5888 6.8841 6.7071 7.3079 5.7505 7.5346 1.0864 1.0391 1.0622 1.0995 1.0952 1.1006 1.0882 1.0849 1.0916 1.0896 1.0950 1.0955 1.1002 1.0783
irintensity: 7.0767 2.8717 0.3981 5.1575 2.1034 10.0258 2.9227 2.6637 11.5035 5.2716 3.1986 1.6621 20.4580 13.5601 7.5877 8.2378 3.5461 0.9214 8.7737 5.2348 4.9694 2.2524 137.6244 19.5810 3.4236 8.9128 0.6214 24.7582 53.7496 10.7075 9.1555 51.4216 6.1536 0.0451 0.4494 10.1666 2.0523 0.1286 11.7399 3.7833 0.0070 3.3463 7.1399 9.5717 1.2354 7.6434 22.2752 8.7723 27.3733 7.9958 22.9333 18.6465 36.6553 9.1285 46.4631 17.1909 65.6873 5.6467 37.6223 8.1531 12.4083 15.1562 18.2938 2.4172 139.0916 79.1219 18.0885 34.1564 16.1120 44.9588 39.9922 1.9862 6.4569 35.2603 301.7152 10.2577 125.9450 79.1259 33.9469 10.4847 24.9291 10.7568 11.9650 0.3102 6.6132 4.4817 28.7317 22.8328 30.7639 15.8099
temp: 298.150 k
press: 1.00000 atm
elementType: 8 7 7 6 6 6 6 6 6 6 6 6 6 6 6 6 6 6 1 1 1 1 1 1 1 1 1 1 1 1 1 1
symmnumber: 1
zpe: 669993.8 jmol-1
zpe.correction: 0.255187 hartree
zpe.thermalcorrener: 0.270661 hartree
zpe.thermalcorrenthalpy: 0.271605 hartree
zpe.thermalcorrgfe: 0.210081 hartree
zpe.sumelectzpe: -763.493555 hartree
zpe.sumelectthermal: -763.478081 hartree
zpe.sumelectthermalent: -763.477137 hartree
zpe.sumelectthermalfe: -763.538661 hartree
dipole: 3.6837 3.9182 2.9369
dipole: 6.1276
quadrupole: -108.3964 -95.0544 -108.0867
quadrupole: -5.8869 -13.0642 -3.4063
quadrupole: -4.5506 8.7914 -4.2408 -5.8869 -13.0642 -3.4063
hfenergy: -763.7487422 hartree
pointgroup: C01 [X(C15H14N2O1)]
dipole: 1.2314455 1.6652867 1.2337735 debye
polarizability: 265.8802368|-13.2321623|208.1173341|16.1958067|2.1663565|92.0800634 unknown
InChI: InChI=1S/C15H14N2O/c1-17-14-5-3-2-4-12(14)13-8-11(9-16-10-18)6-7-15(13)17/h2-8,10,16H,9H2,1H3
charge 0 multiplicity 1
32 atoms
O  -4.9814 -2.150753 -0.930532
N  1.949632 1.565885 0.159635
N  -4.133518 -0.511766 0.518201
C  0.183937 0.087189 -0.100342
C  0.555406 1.476388 -0.009482
C  1.416798 -0.68458 0.002745
C  2.488825 0.263473 0.154215
C  -1.172899 -0.261828 -0.263309
C  -2.154497 0.755733 -0.334594
C  -0.409702 2.501861 -0.086943
C  1.709034 -2.06769 -0.021586
C  -1.760567 2.121926 -0.245151
C  3.833828 -0.148201 0.272724
C  2.716952 2.804265 0.265188
C  -3.623334 0.398036 -0.529232
C  3.050905 -2.486947 0.102329
C  4.09893 -1.535149 0.246817
C  -4.761615 -1.708171 0.232449
H  -1.475154 -1.31298 -0.339553
H  -0.134817 3.560185 -0.033966
H  0.907166 -2.805245 -0.138092
H  -2.529511 2.902024 -0.307756
H  4.652716 0.571797 0.372987
H  3.031929 3.183431 -0.726426
H  2.110749 3.579979 0.762869
H  3.617064 2.635043 0.879771
H  -4.235799 1.32037 -0.553391
H  -3.790822 -0.133649 -1.484488
H  3.292495 -3.554979 0.083318
H  5.133826 -1.884444 0.33561
H  -3.978709 -0.255737 1.495913
H  -5.05745 -2.258463 1.155374
