program: Gaussian 09
title: 000040555
version: EM64L-G09RevD.01
frameworkgroup: C1[X(C4H7Cl)]
method: RPBEPBE
basis: SDD
operation: Freq
keyword: #pfreq=noraman
keyword: PBEPBE/SDD
title: #p freq=noraman PBEPBE/SDD
converged: NO NO NO NO
title: Mulliken charges:
elementType: Cl C C C C H H H H H H H
charge: -0.099161 -0.430094 -0.653067 0.169181 -0.588908 0.231160 0.215280 0.234363 0.219474 0.223166 0.248720 0.229885
chargesum: 0.00000
title: Mulliken charges with hydrogens summed into heavy atoms:
elementType: Cl C C C C
charge: -0.099161 0.016347 0.023936 0.169181 -0.110303
polarizability: 5.50237499e+01 -1.06155823e+00 6.51925878e+01 3.88055742e+00 -3.17388870e+00 3.43666159e+01
1716.lowfreq: -0.0040 -0.0014 0.0016 9.4770 16.4370 19.8376 89.5069 213.4320 214.8930
frequency: 89.4815 213.4229 214.8911 353.5487 371.6826 547.3813 549.7260 683.8342 791.9349 848.9704 913.3666 996.7833 1052.3758 1076.7817 1164.0509 1258.8482 1311.6783 1388.7549 1407.4972 1452.2151 1473.2850 1487.3410 1664.2248 2988.1997 2993.7594 3044.5240 3092.3442 3102.3577 3111.3713 3226.7275
redmass: 2.2590 1.8340 1.5915 2.6001 2.6252 4.8056 3.9855 1.0338 1.1804 2.0011 1.3359 1.5180 2.3398 1.5878 2.2053 1.1854 1.3918 1.1925 1.1528 1.0870 1.0408 1.0552 6.2424 1.0582 1.0363 1.1010 1.1004 1.1009 1.0637 1.1139
irintensity: 0.4540 0.7495 0.5455 1.8430 0.8439 16.9128 25.4702 0.2302 9.7856 12.5452 90.1810 14.3991 7.5631 3.5407 51.0580 9.5747 0.7207 11.8240 4.2192 11.0227 14.3292 12.9793 62.7891 25.0661 26.5031 10.3161 36.0155 29.5106 2.1822 4.8795
temp: 298.150 k
press: 1.00000 atm
elementType: 17 6 6 6 6 1 1 1 1 1 1 1
symmnumber: 1
zpe: 256427.7 jmol-1
zpe.correction: 0.097668 hartree
zpe.thermalcorrener: 0.103899 hartree
zpe.thermalcorrenthalpy: 0.104843 hartree
zpe.thermalcorrgfe: 0.067579 hartree
zpe.sumelectzpe: -616.256533 hartree
zpe.sumelectthermal: -616.250302 hartree
zpe.sumelectthermalent: -616.249358 hartree
zpe.sumelectthermalfe: -616.286622 hartree
dipole: 1.6131 1.3700 0.1618
dipole: 2.1225
quadrupole: -37.1337 -36.3418 -39.2525
quadrupole: -0.9792 1.3167 -0.5394
quadrupole: 0.4423 1.2342 -1.6765 -0.9792 1.3167 -0.5394
hfenergy: -616.3542013 hartree
pointgroup: C01 [X(C4H7Cl1)]
dipole: 0.516689 -0.5920958 -0.2824639 debye
dipolederiv: -0.3031292 0.2115278 0.11395 0.1558943 -0.6286463 -0.1673565 0.1105059 -0.1888147 -0.1835839 -0.0672776 -0.0242402 0.0423437 0.0068333 -0.0407769 -0.0649299 0.0549253 -0.0710978 0.0961837 0.007438 -0.0328121 -0.0348597 0.007631 0.0681481 -0.0351981 0.0337527 -0.004554 0.0206182 0.5013612 -0.139982 -0.2563328 -0.1659482 1.0035326 0.2670681 -0.32842 0.2622569 0.036695 -0.2631455 -0.099797 -0.1103304 -0.1046649 -0.3865584 0.0317667 -0.0753374 0.0348248 -0.344643 0.030796 -0.0203728 -0.0171227 -0.0059797 0.0092762 0.1331663 0.000297 0.1018429 -0.0429665 0.0021698 0.0409498 0.0301845 0.0321076 -0.0977682 -0.1167065 0.0206905 -0.0860392 0.0501668 0.1038954 0.0782352 0.020016 0.0206074 -0.0785542 -0.0878392 -0.0115243 -0.0666788 0.0535744 -0.1734595 -0.0427042 0.0756172 -0.0312054 0.0999911 0.0015153 0.0901104 -0.0010087 0.0360369 0.0850891 -0.0163183 -0.0128263 0.0195735 -0.0201776 0.1311963 -0.0568613 0.0974348 -0.0579495 -0.0053947 -0.0040032 0.0911065 -0.0051469 0.1063728 -0.023224 0.1016279 -0.0161064 0.1813941 0.0816569 0.0495169 0.0582539 0.0702979 -0.0348394 -0.0694585 0.0602333 -0.0620598 0.1544739 unknown
polarizability: 54.9350782|4.235563|63.5554507|-5.0487309|5.6828095|36.0924248 unknown
InChI: InChI=1S/C4H7Cl/c1-3-4(2)5/h2-3H2,1H3
charge 0 multiplicity 1
12 atoms
Cl -1.144585 1.32501 0.566307
C  0.966562 -0.125765 -0.596015
C  2.011024 0.323755 0.456736
C  -0.429805 -0.27436 -0.046462
C  -1.187869 -1.386729 0.05089
H  0.950697 0.603569 -1.428999
H  1.263953 -1.102121 -1.024723
H  1.741341 1.305656 0.881654
H  3.008346 0.410283 -0.009944
H  2.075927 -0.403626 1.284749
H  -2.195425 -1.378755 0.47317
H  -0.787364 -2.344516 -0.300063
