program: Gaussian 09
title: 000040570
version: EM64L-G09RevD.01
frameworkgroup: C1[X(C11H15NO4)]
method: RPBEPBE
basis: SDD
operation: Freq
keyword: #p
keyword: freq=noraman
keyword: PBEPBE/SDD
title: #p freq=noraman PBEPBE/SDD
converged: YES YES NO NO
title: Mulliken charges:
elementType: O O O O N C C C C C C C C C C C H H H H H H H H H H H H H H H
charge: -0.290605 -0.289421 -0.285837 -0.435728 -0.119229 0.428408 0.051671 0.293858 0.245249 -0.550066 -0.546443 0.098608 -0.800807 -0.521903 -0.534142 -0.499099 0.284384 0.263575 0.283055 0.238746 0.241709 0.267324 0.202861 0.229051 0.231571 0.224194 0.240075 0.252862 0.203008 0.225944 0.367126
chargesum: 0.00000
title: Mulliken charges with hydrogens summed into heavy atoms:
elementType: O O O O N C C C C C C C C C C C
charge: -0.290605 -0.289421 -0.285837 -0.068602 -0.119229 0.428408 0.051671 0.293858 0.245249 -0.265682 -0.282868 0.098608 -0.037298 0.177333 0.161698 0.182715
polarizability: 2.27426689e+02 1.01019392e+01 1.67756205e+02 6.59147696e-01 1.53626100e+00 7.73093180e+01
1716.lowfreq: -4.8681 -2.6623 -0.0003 0.0006 0.0008 7.1387 33.1822 46.3363 66.0698
frequency: 33.1452 46.3015 66.0526 88.1104 105.9258 117.3615 133.6270 144.2212 150.1722 179.6830 194.1055 213.4636 225.1348 261.9457 279.0096 282.7819 293.4655 309.9789 345.4030 356.6142 393.7918 415.2660 443.3245 482.3302 515.8020 528.7967 580.0418 627.2467 654.7010 675.7758 715.6282 750.7236 836.0802 863.1326 869.7614 879.6742 910.3902 948.1872 985.0327 1004.6459 1036.9788 1071.0667 1090.8039 1107.9153 1109.0864 1113.6990 1147.7405 1154.6262 1159.9679 1184.2136 1224.8249 1230.4261 1274.5553 1350.5515 1375.7821 1387.8834 1405.4700 1420.2911 1440.2978 1442.9662 1451.6514 1453.2923 1464.5585 1465.3510 1470.4604 1472.2839 1480.2035 1484.2724 1485.6508 1558.6459 1591.4352 1605.8145 2964.5973 2966.2694 2974.2819 2992.8906 3056.4438 3070.6447 3078.6989 3085.6943 3123.6787 3123.7900 3125.1557 3133.5605 3177.8481 3180.6834 3574.6059
redmass: 3.5586 3.1701 3.6688 3.4755 1.9005 3.6011 3.3480 1.0880 1.4675 1.6895 2.1993 1.6722 4.5461 2.5580 4.7080 2.4945 4.0465 4.5363 4.8619 3.9757 2.0277 2.8256 2.7967 5.1011 3.1778 5.5138 4.7364 5.5514 3.8247 4.0388 4.2437 3.8147 6.5580 1.4806 6.4454 1.6982 9.1275 9.0900 2.3996 3.4739 1.5854 4.7365 2.1420 1.2468 1.2427 1.2584 1.4660 1.3898 1.5664 3.6212 1.7795 1.5099 1.8523 3.9224 2.3441 1.5660 3.2468 1.2250 1.3162 1.2636 1.0829 1.1060 1.1023 1.0498 1.3791 1.0544 1.0482 1.0854 1.8614 5.7231 7.1382 6.5300 1.0357 1.0332 1.0353 1.0387 1.1040 1.0973 1.0945 1.0958 1.1011 1.1050 1.1048 1.0971 1.0904 1.0913 1.0673
irintensity: 0.1622 3.7509 6.4116 2.8692 1.6409 2.2480 5.4504 0.1831 1.5820 2.7400 2.3633 0.8291 2.5795 1.1503 2.2757 0.1776 4.4239 2.5213 13.4166 8.0549 64.4643 34.2740 41.1672 5.3264 10.6985 6.6534 5.5685 38.4464 10.0886 33.5495 1.7847 9.1311 43.2316 1.5221 28.6187 55.7844 108.9901 50.3861 66.4249 26.3921 0.6435 203.7306 35.0849 5.1001 15.6377 0.1061 9.8399 17.0469 50.6053 41.0000 22.8824 21.5817 219.8681 77.5772 56.8386 46.5721 109.6312 1.7922 16.1628 18.8558 14.1188 4.9644 11.9645 13.3261 75.6858 32.9991 20.8339 28.7706 41.2026 114.6896 34.6647 11.0926 93.8078 48.6884 87.9321 10.1460 41.1272 13.1669 37.1165 50.1482 30.9799 9.8397 18.7985 7.9628 4.3095 0.9602 72.0278
temp: 298.150 k
press: 1.00000 atm
elementType: 8 8 8 8 7 6 6 6 6 6 6 6 6 6 6 6 1 1 1 1 1 1 1 1 1 1 1 1 1 1 1
symmnumber: 1
zpe: 641488.2 jmol-1
zpe.correction: 0.244330 hartree
zpe.thermalcorrener: 0.262089 hartree
zpe.thermalcorrenthalpy: 0.263033 hartree
zpe.thermalcorrgfe: 0.198603 hartree
zpe.sumelectzpe: -782.490211 hartree
zpe.sumelectthermal: -782.472452 hartree
zpe.sumelectthermalent: -782.471508 hartree
zpe.sumelectthermalfe: -782.535938 hartree
dipole: -0.8209 2.0351 1.8787
dipole: 2.8888
quadrupole: -82.6489 -80.4359 -97.5568
quadrupole: 4.8008 -6.0617 -1.0587
quadrupole: 4.2316 6.4446 -10.6763 4.8008 -6.0617 -1.0587
hfenergy: -782.734541 hartree
pointgroup: C01 [X(C11H15N1O4)]
dipole: -0.299597 -0.7630157 -0.7872309 debye
polarizability: 224.4728036|-14.2939248|169.3081991|13.9110508|1.8753378|78.7112094 unknown
InChI: InChI=1S/C11H15NO4/c1-7(12-13)8-5-9(14-2)11(16-4)10(6-8)15-3/h5-6,13H,1-4H3
charge 0 multiplicity 1
31 atoms
O  -2.902373 0.035745 0.039974
O  -1.415596 -2.310385 -0.103551
O  -1.461176 2.591986 0.112973
O  4.940477 -0.66975 0.223459
N  3.486863 -0.849644 0.12783
C  1.359502 0.22413 0.108467
C  -1.497717 0.083581 -0.038459
C  -0.69334 -1.10399 -0.055118
C  -0.836577 1.339745 0.045157
C  0.707962 -1.038868 0.007677
C  0.577515 1.398059 0.126969
C  2.844645 0.307607 0.194008
C  3.523238 1.652629 0.347696
C  -3.619606 -0.636994 -1.065331
C  -0.648287 -3.555301 -0.010493
C  -2.792991 2.803834 -0.479695
H  1.325298 -1.939411 -0.000832
H  1.026269 2.391994 0.193631
H  4.612601 1.530068 0.425362
H  3.299707 2.300533 -0.519728
H  3.154862 2.169693 1.252068
H  -3.319493 -1.694689 -1.134362
H  -3.421963 -0.119802 -2.025653
H  -4.686312 -0.553468 -0.806144
H  -0.068808 -3.595478 0.931315
H  0.036959 -3.671772 -0.87211
H  -1.401454 -4.357136 -0.021059
H  -3.57912 2.328404 0.126474
H  -2.834635 2.410851 -1.51419
H  -2.913971 3.898656 -0.493496
H  5.26352 -1.604626 0.16236
