program: Gaussian 09
title: 000040542
version: EM64L-G09RevD.01
frameworkgroup: C1[X(C7H6ClN3O2)]
method: RPBEPBE
basis: SDD
operation: Freq
keyword: #p
keyword: freq=noraman
keyword: PBEPBE/SDD
title: #p freq=noraman PBEPBE/SDD
converged: NO YES NO NO
title: Mulliken charges:
elementType: Cl O O N N N C C C C C C C H H H H H H
charge: -0.041136 -0.232836 -0.206464 -0.420295 0.114652 0.128286 0.488354 -0.398263 -0.339293 -0.172705 -0.167018 -0.129367 -0.225308 0.230941 0.297162 0.259584 0.262315 0.293596 0.257796
chargesum: 0.00000
title: Mulliken charges with hydrogens summed into heavy atoms:
elementType: Cl O O N N N C C C C C C C
charge: -0.041136 -0.232836 -0.206464 -0.126699 0.114652 0.128286 0.488354 -0.167322 -0.042132 0.086879 0.095296 -0.129367 0.032488
polarizability: 2.89868490e+02 5.87492860e-01 1.13994059e+02 1.43487307e-03 1.10347723e-03 4.23292648e+01
1716.lowfreq: -0.0027 -0.0015 -0.0013 2.8959 7.5348 14.4643 43.0099 52.6983 58.8781
frequency: 43.0094 52.6946 58.8764 110.5971 189.5115 202.7563 245.2841 259.0608 291.3755 334.3502 405.1582 410.2292 430.7403 506.4854 579.6119 623.1434 658.3824 665.1194 675.2059 698.1494 704.3917 810.6455 827.1648 833.8251 842.4211 939.4513 960.8725 978.0045 992.3241 1072.5133 1110.0143 1155.9707 1176.9273 1192.9686 1238.4864 1284.0625 1300.2428 1371.8687 1391.5001 1410.4067 1477.6755 1519.9241 1570.7098 1602.4810 1606.8792 3107.7268 3128.3373 3168.2330 3177.3411 3187.4266 3391.9358
redmass: 12.8993 5.6831 11.2802 5.9083 10.2465 4.4011 12.4845 4.0312 6.3131 5.5060 8.4782 2.9697 7.5262 2.7898 7.8076 7.2220 1.3899 4.7846 6.9146 9.6769 3.6023 1.3593 5.6996 1.5842 1.4183 1.3544 4.8271 1.3328 3.8584 2.8429 1.4292 4.1681 1.1166 7.6540 1.7777 1.6209 1.6256 6.4327 4.3602 3.7895 2.3285 2.0425 7.1056 5.1710 5.3086 1.0924 1.0905 1.0894 1.0952 1.0972 1.0752
irintensity: 0.4293 1.6121 4.2737 7.2990 0.0779 19.3141 0.6159 17.6594 2.9207 0.3988 18.0513 0.0801 5.3113 32.1207 9.2326 0.1901 40.5755 7.9565 2.1039 24.2446 1.1386 30.7084 2.9375 88.5947 47.2407 0.8591 59.9296 1.5524 24.6411 83.9996 18.6078 187.7677 1.2195 534.2181 32.6019 18.9697 7.5316 14.1912 87.4995 4.6157 175.6293 5.5326 392.3318 3.0307 0.8309 10.9794 10.6931 1.0630 2.7158 0.6254 12.0359
temp: 298.150 k
press: 1.00000 atm
elementType: 17 8 8 7 7 7 6 6 6 6 6 6 6 1 1 1 1 1 1
symmnumber: 1
zpe: 334789.7 jmol-1
zpe.correction: 0.127515 hartree
zpe.thermalcorrener: 0.139134 hartree
zpe.thermalcorrenthalpy: 0.140078 hartree
zpe.thermalcorrgfe: 0.087983 hartree
zpe.sumelectzpe: -1044.042204 hartree
zpe.sumelectthermal: -1044.030585 hartree
zpe.sumelectthermalent: -1044.029640 hartree
zpe.sumelectthermalfe: -1044.081736 hartree
dipole: 3.6083 5.2276 0.0002
dipole: 6.3519
quadrupole: -117.9322 -71.3972 -83.5763
quadrupole: -9.9245 0.0005 0.0015
quadrupole: -26.9636 19.5714 7.3923 -9.9245 0.0005 0.0015
hfenergy: -1044.1697187 hartree
pointgroup: C01 [X(C7H6Cl1N3O2)]
dipole: -1.4939774 2.0033167 0.0008669 debye
dipolederiv: -0.983603 -0.2024849 0.0000301 -0.2869544 -0.1820879 -0.000011 -0.0000083 -0.000022 -0.0565297 -1.2955209 -0.158282 0.0000769 -0.1183095 -0.4869591 -0.0000886 0.0001104 -0.000086 -0.25349 -0.4577932 -0.0026416 0.0000344 0.4843964 -0.8290218 -0.0003412 0.0002438 -0.000282 -0.2181947 -1.3501696 -0.0963194 0.000086 1.0622654 0.031617 -0.0000854 0.0005471 0.0000591 -0.2786307 1.7737735 -0.2073253 -0.0001958 -0.7157002 -0.1940167 0.0000273 -0.0004682 -0.0000655 0.0161447 2.1382878 -0.0742481 -0.000321 -1.0752436 1.1853106 0.0006179 -0.0007236 0.0005029 0.1696257 1.0194339 0.2316062 -0.0000136 0.3443115 0.0309292 -0.0000305 0.0000092 -0.0000193 0.0777389 -0.1236109 -0.0559001 -0.0000257 -0.0192436 0.0777514 0.0000968 -0.0000279 0.000093 -0.1929869 -0.047388 -0.0106045 -0.0000155 -0.0539981 -0.0444899 0.000036 -0.0000277 0.0000384 -0.148718 -0.1971611 -0.0674532 -0.0000093 -0.2812087 -0.0054994 0.0000544 -0.0000879 0.0000298 -0.0829003 -0.4008463 -0.0596981 0.0000172 0.0716383 0.0678293 0.0000429 0.0000565 0.0000589 -0.083254 1.2863537 0.3402863 -0.0000276 0.3684023 0.1444222 0.000038 -0.0000035 0.0000412 -0.0874584 -1.6216257 0.3312454 0.0002397 0.2268215 0.1900412 0.000021 0.0002543 -0.0000099 -0.1235347 0.0655638 -0.0839464 -0.000016 -0.0611442 -0.078138 -0.000077 -0.0000067 -0.0000759 0.1733696 0.061636 0.0554961 0.0000304 0.0551588 0.0772307 -0.0000398 0.0000345 -0.0000388 0.1751832 0.0033682 0.0687308 0.000039 0.0663905 0.0471389 -0.0000449 0.0000388 -0.0000415 0.1654995 0.0754931 -0.0308041 -0.0000009 -0.0401662 -0.0164178 -0.0000553 -0.0000045 -0.0000581 0.1620735 0.0360612 0.0162978 0.0000295 -0.0649631 0.0432026 -0.0000515 -0.0000172 -0.0000599 0.3415539 0.0177475 0.0060452 0.0000423 0.0375469 -0.0588425 -0.0001091 0.0000809 -0.0000642 0.2445084 unknown
polarizability: 289.6756153|5.8505728|114.1869216|-0.0269951|0.025087|42.3292769 unknown
InChI: InChI=1S/C7H6ClN3O2/c8-6-1-3-7(4-2-6)10-9-5-11(12)13/h1-5,10H
charge 0 multiplicity 1
19 atoms
Cl -5.136041 -0.913016 -0.000064
O  5.120724 0.192084 -0.000941
O  3.679135 -1.597342 -0.001521
N  0.572656 1.056312 0.000011
N  1.610655 0.202302 -0.000326
N  3.929782 -0.334716 -0.000985
C  -0.76119 0.568795 -0.000022
C  -1.822835 1.507656 0.000396
C  -1.029473 -0.823373 -0.000444
C  -3.159183 1.058252 0.00039
C  -2.364597 -1.270678 -0.000448
C  -3.413089 -0.327298 -0.000033
C  2.841419 0.642398 -0.000309
H  -1.617506 2.585058 0.000734
H  -0.196816 -1.531007 -0.000765
H  -3.985307 1.77433 0.000701
H  -2.585829 -2.341614 -0.000787
H  0.715222 2.077328 0.000175
H  3.208071 1.677328 -0.000062
