program: Gaussian 09
title: 000040541
version: EM64L-G09RevD.01
frameworkgroup: C1[X(C11H10O3)]
method: RPBEPBE
basis: SDD
operation: Freq
keyword: #pfreq=noraman
keyword: PBEPBE/SDD
title: #p freq=noraman PBEPBE/SDD
converged: NO YES NO NO
title: Mulliken charges:
elementType: O O O C C C C C C C C C C C H H H H H H H H H H
charge: -0.274569 -0.259416 -0.223893 0.281416 0.224038 -0.435876 0.262256 -0.517574 -0.372875 0.349258 -0.354354 0.093745 -0.754616 -0.534937 0.294536 0.269395 0.253529 0.255150 0.245727 0.250422 0.245960 0.226093 0.226090 0.250495
chargesum: 0.00000
title: Mulliken charges with hydrogens summed into heavy atoms:
elementType: O O O C C C C C C C C C C C
charge: -0.274569 -0.259416 -0.223893 0.281416 0.224038 -0.141340 0.262256 -0.248179 -0.119347 0.349258 -0.099205 0.093745 -0.012507 0.167742
polarizability: 2.39580079e+02 5.03297606e-01 1.30736204e+02 1.20124995e-02 1.93023720e-02 6.05972622e+01
1716.lowfreq: -5.5721 -4.1681 -0.0012 -0.0011 -0.0010 3.3667 49.6664 70.6101 78.5572
frequency: 49.5485 70.5540 78.5549 110.2962 112.0177 183.9171 203.5658 237.5595 263.9478 301.3186 353.0102 354.5364 420.9964 436.3417 507.3624 522.9225 537.0230 568.6651 625.3711 637.3792 644.8576 732.0364 741.3830 815.0246 818.1855 837.9018 875.0216 881.1274 926.1617 952.7900 960.2342 985.7156 1023.0590 1035.8893 1098.6527 1113.3539 1139.6255 1157.3046 1169.9840 1216.3309 1258.4740 1270.3766 1314.4920 1371.2006 1400.8307 1432.9814 1439.1264 1442.0645 1447.9923 1467.5677 1472.5537 1484.7416 1555.2390 1580.6550 1591.4155 1631.7345 2964.6715 2991.5417 3054.4837 3075.4921 3131.4134 3133.2075 3153.6786 3178.9073 3186.7997 3234.8182
redmass: 1.4038 2.1638 4.4071 3.8586 4.3554 3.0838 3.7333 1.3980 4.0571 4.6276 5.7649 5.4097 4.2797 2.9075 4.7873 3.6136 4.9022 5.5260 3.8019 4.8749 3.3673 6.7951 3.2865 4.4000 1.3769 1.6603 7.1432 1.4473 5.5279 2.1502 1.3338 3.9741 1.7604 2.3728 2.1526 1.2598 1.4308 1.4632 1.6733 2.8844 3.7092 2.3425 3.5839 1.2451 3.7165 1.2901 1.2082 3.6028 1.0483 1.0493 1.0770 3.0305 7.7080 7.8801 7.9348 7.6701 1.0329 1.0367 1.1042 1.0962 1.1008 1.0997 1.0891 1.0967 1.0923 1.0984
irintensity: 2.1148 0.0058 1.4011 10.7423 0.9845 0.8279 10.8984 0.0515 0.0503 1.5647 5.3494 5.4712 3.1603 5.3996 35.4719 0.5943 3.3791 2.3462 9.2709 12.4630 3.4800 0.6453 0.2755 2.3645 13.4468 47.2555 23.4466 52.7571 7.6393 46.4088 0.3856 47.4108 4.0454 0.2376 118.1228 0.1511 14.7724 36.0916 21.2681 181.5598 100.0802 105.1032 53.8255 53.6323 7.0516 31.4063 29.5015 42.2284 19.4449 14.6318 71.4568 70.0167 362.7566 98.3761 58.2953 167.8783 58.4972 1.6614 43.8475 10.2445 20.2616 20.3477 4.1272 7.6795 3.0256 0.9289
temp: 298.150 k
press: 1.00000 atm
elementType: 8 8 8 6 6 6 6 6 6 6 6 6 6 6 1 1 1 1 1 1 1 1 1 1
symmnumber: 1
zpe: 478302.8 jmol-1
zpe.correction: 0.182176 hartree
zpe.thermalcorrener: 0.194881 hartree
zpe.thermalcorrenthalpy: 0.195825 hartree
zpe.thermalcorrgfe: 0.142490 hartree
zpe.sumelectzpe: -649.818126 hartree
zpe.sumelectthermal: -649.805421 hartree
zpe.sumelectthermalent: -649.804477 hartree
zpe.sumelectthermalfe: -649.857812 hartree
dipole: 4.3053 -2.3245 -0.0022
dipole: 4.8927
quadrupole: -91.7104 -68.9211 -83.5005
quadrupole: -0.3349 0.0094 -0.0039
quadrupole: -10.3330 12.4562 -2.1232 -0.3349 0.0094 -0.0039
hfenergy: -650.0003016 hartree
pointgroup: C01 [X(C11H10O3)]
dipole: 1.6707466 0.956061 0.0006936 debye
dipolederiv: -0.5366853 -0.1048804 0.0002136 0.175787 -0.5147775 -0.0003816 0.0010606 -0.000296 -0.1283022 -1.684901 -0.5887589 0.0003348 -0.78765 -0.6942017 0.0001542 0.0004998 0.0000882 -0.2943011 -1.3764746 -0.0178306 0.0011522 -0.4779311 -0.6025175 0.0011018 -0.0031973 -0.0007654 -0.3226801 -0.5054419 -0.0573002 0.0000876 -0.0560021 -0.2670594 -0.0000672 0.0004553 -0.0000394 -0.010333 0.5907481 0.0566928 -0.000408 0.0472418 0.2478589 0.0001787 -0.0000841 0.0000211 0.0866318 0.619423 0.0873578 -0.0004042 -0.2621309 0.0119754 0.0002379 -0.0001427 -0.0001607 -0.13643 -1.1058946 0.3605931 0.000281 1.0322754 0.1208526 -0.0001484 0.0010767 -0.0003066 -0.0037307 -0.5787125 -0.0927731 0.0000975 0.1738677 -0.0693237 0.0000369 0.0003529 0.0001829 -0.2305944 0.534636 -0.0304651 -0.0003979 -0.1000834 0.1676779 0.0002011 -0.0006831 0.0002086 -0.133429 1.5350736 0.5381316 -0.0004641 0.6281257 0.3708072 -0.0001751 -0.0007243 -0.0001769 0.101673 -0.359863 -0.1046773 -0.0000265 -0.6404509 -0.1414912 0.000362 -0.0003863 0.0000768 -0.182525 2.2452909 -0.314826 -0.0008543 -0.3228239 1.0302869 -0.0013136 0.0027304 -0.000341 0.1381521 -0.0066499 0.0341987 -0.0000159 0.257258 -0.5212363 0.0011149 -0.0019807 0.0030566 0.039582 0.3721308 0.1101996 0.0000725 0.6216683 0.6382258 -0.000114 0.0004249 0.0001703 0.3228047 0.0775745 -0.0345832 0.000041 -0.0468318 0.0655259 -0.0000567 0.0000438 -0.0000442 0.1819146 0.0933482 -0.0104015 0.0000609 -0.0502518 -0.0273392 -0.0001206 0.0000734 -0.0001404 0.1910892 0.0833167 -0.0355072 0.0000348 0.0085227 -0.0745776 -0.0001613 0.000064 -0.0001369 0.1608928 -0.0216275 0.0798522 0.0001796 0.0634415 0.0607014 -0.0001194 0.000191 -0.0001186 0.172912 0.0631345 -0.0160572 -0.094239 -0.0128238 0.0723251 -0.0397255 -0.064828 -0.0729405 -0.0180151 -0.1243525 0.0686572 -0.0001094 0.0107499 0.0822371 -0.0000007 -0.0001653 0.0000133 0.1218897 0.0624208 -0.0151868 0.0943235 -0.0123384 0.0729717 0.0388181 0.065471 0.0716696 -0.017863 0.0868884 0.0790551 0.1058105 -0.1060461 -0.0517195 -0.058146 0.0358642 -0.0904876 -0.0825584 0.0867231 0.0793303 -0.1058611 -0.1059278 -0.0519853 0.0583407 -0.0362401 0.090462 -0.0821591 -0.1501058 -0.0708209 0.0000909 -0.0376459 0.0747832 -0.0000163 0.0001238 0.0000048 0.1253791 unknown
polarizability: 239.538603|2.1826154|130.7776408|-0.0622575|0.0401462|60.5973016 unknown
InChI: InChI=1S/C11H10O3/c1-7(12)10-5-8-3-4-9(13-2)6-11(8)14-10/h3-6H,1-2H3
charge 0 multiplicity 1
24 atoms
O  -1.043431 0.937022 0.002298
O  3.894347 0.453785 -0.001435
O  -4.367643 -0.577255 -0.000466
C  -0.011548 -1.142938 0.000146
C  0.191471 0.270449 0.000971
C  -1.439244 -1.348524 0.000971
C  -2.042555 -0.09584 0.002464
C  1.447925 0.894896 0.000559
C  1.134197 -1.987909 -0.00122
C  2.563641 0.022988 -0.000804
C  2.405424 -1.401063 -0.00169
C  -3.45851 0.308676 0.004057
C  -3.764244 1.798804 -0.000014
C  4.143145 1.899003 -0.00034
H  -1.983485 -2.290582 0.000715
H  1.537738 1.982852 0.001218
H  1.02887 -3.077093 -0.001907
H  3.314681 -2.008844 -0.002745
H  -3.31961 2.289267 0.885313
H  -4.854374 1.947143 -0.001315
H  -3.318365 2.284854 -0.887209
H  3.722387 2.375825 0.90587
H  3.721409 2.377356 -0.905288
H  5.237573 2.001029 -0.000847
