program: Gaussian 09
title: 000040575
version: EM64L-G09RevD.01
frameworkgroup: C1[X(C19H27NO4)]
method: RPBEPBE
basis: SDD
operation: Freq
keyword: #p
keyword: freq=noraman
keyword: PBEPBE/SDD
title: #p freq=noraman PBEPBE/SDD
converged: YES YES NO NO
title: Mulliken charges:
elementType: O O O O N C C C C C C C C C C C C C C C C C C C H H H H H H H H H H H H H H H H H H H H H H H H H H H
charge: -0.299013 -0.318998 -0.306361 -0.274472 -0.148538 0.271323 -0.184881 -0.206709 -0.434169 -0.433037 -0.437460 -0.448081 -0.430471 0.467000 0.307521 -0.555530 -0.398107 -0.538964 0.310176 -0.241170 -0.389676 -0.204675 -0.678328 -0.536700 0.223362 0.212574 0.227929 0.196188 0.193867 0.211026 0.240598 0.253204 0.250723 0.243987 0.235213 0.197226 0.259125 0.238136 0.201441 0.230073 0.228610 0.223182 0.244566 0.224491 0.223542 0.209523 0.225422 0.227399 0.222231 0.220369 0.245312
chargesum: 0.00000
title: Mulliken charges with hydrogens summed into heavy atoms:
elementType: O O O O N C C C C C C C C C C C C C C C C C C C
charge: -0.299013 -0.318998 -0.306361 -0.274472 -0.148538 0.271323 0.038481 0.005865 -0.010052 -0.028144 0.056343 0.046629 0.001968 0.467000 0.307521 -0.296405 -0.159971 0.121160 0.310176 -0.017988 -0.145110 0.243358 -0.015984 0.151213
polarizability: 2.60414653e+02 -1.53373495e+01 2.16615697e+02 -8.58037670e+00 -1.21772131e+01 1.91688883e+02
1716.lowfreq: -8.9627 -0.0006 -0.0006 0.0000 5.8379 8.7202 19.3754 27.1751 33.8997
frequency: 16.5234 27.0624 33.8668 64.5405 71.0180 89.4116 95.9700 103.8324 116.3602 127.8073 148.2120 153.4310 171.0955 194.9063 210.8394 226.1270 240.8288 247.3254 265.6124 268.5126 285.9370 295.0313 299.0041 310.8584 328.0258 350.3943 375.3545 396.3127 410.6531 455.9604 463.4803 478.5066 497.4030 523.2096 550.5092 561.3858 618.4525 627.8343 647.6105 664.9392 693.1859 706.0888 757.7462 761.5302 787.9186 799.0830 806.3144 812.5735 820.4994 841.0182 860.4258 873.8747 887.2428 907.4159 917.8926 954.0770 965.2892 968.1019 973.4255 985.6972 989.5267 996.0913 1012.2151 1028.6499 1030.1352 1055.0545 1082.2057 1095.8589 1101.9003 1109.1342 1114.1544 1116.3576 1120.2346 1121.1740 1139.2371 1149.1661 1156.0936 1163.7086 1173.4766 1187.6455 1205.1108 1217.2495 1231.0787 1239.4037 1247.1806 1260.6592 1262.0918 1285.9870 1292.5974 1300.9416 1315.4026 1335.6236 1338.6003 1350.0985 1356.8307 1359.5207 1366.6630 1377.4246 1388.5142 1395.2102 1409.9544 1427.3633 1432.9468 1442.1857 1454.1589 1459.0589 1461.6395 1461.7447 1466.9731 1475.8635 1476.8740 1477.4774 1479.9099 1480.7881 1482.9803 1485.5463 1491.7985 1586.4542 1617.9020 1635.4702 2943.7944 2959.5658 2965.9540 2973.8206 2979.8287 2985.5379 2992.2702 2992.8085 3002.2464 3007.2408 3017.5388 3027.5784 3034.0061 3047.2982 3049.8886 3063.7230 3070.4074 3077.8692 3090.0011 3092.7095 3097.2290 3103.0408 3124.8220 3131.8806 3157.9769 3160.4882 3170.5055
redmass: 3.0706 4.0458 3.2232 3.4836 4.0690 4.2519 3.0638 4.0028 3.0726 2.0928 2.4035 3.6025 2.1048 2.0825 2.0633 3.7623 3.3052 1.2106 1.6744 2.9430 3.4286 3.8741 3.5719 4.4135 2.7096 3.5944 2.6215 2.3153 3.3556 3.2735 3.4208 3.7624 4.9388 2.7439 4.5809 4.7607 3.7820 4.4888 4.9212 5.6612 10.6925 1.8843 5.7994 2.8411 1.8105 1.0942 2.7388 2.6939 2.9363 2.9634 1.5806 1.6431 1.7738 2.1028 3.0034 2.2187 2.0274 1.4868 2.5762 4.5672 2.3155 4.4389 5.4272 3.0615 2.7284 3.7780 1.7696 1.5901 1.7722 2.1113 1.2588 1.4736 1.7566 1.5225 1.4632 1.4588 1.4078 1.5341 1.7111 1.1932 1.6638 1.6518 2.6732 3.4678 1.1326 1.4015 1.4312 1.7571 1.8137 1.3558 1.3518 1.4826 1.4318 1.3690 1.3174 1.3696 1.3535 1.4249 6.7766 1.3077 2.4118 1.8631 1.1284 1.5160 1.0818 1.0547 1.0530 1.0691 1.0501 1.1171 1.0526 1.1868 1.2117 1.3912 1.1513 1.0881 1.0807 5.9694 6.5195 9.9151 1.0348 1.0329 1.0687 1.0712 1.0646 1.0656 1.0705 1.0385 1.0685 1.0581 1.0831 1.0999 1.0986 1.1039 1.0989 1.1065 1.0989 1.0935 1.0985 1.0924 1.0991 1.1026 1.0993 1.0868 1.0908 1.0909 1.0970
irintensity: 0.1337 0.1657 0.1286 1.4318 1.1006 5.2282 1.9452 2.8834 3.8514 1.6215 0.6555 1.0670 2.1379 2.2046 1.7923 0.6304 4.3974 0.8844 0.4896 4.5820 2.6209 3.1938 9.7078 1.5643 1.7283 8.0858 17.1976 1.3039 0.4785 2.3287 2.2764 1.2271 7.2652 2.3820 7.0623 11.7103 0.7276 2.4834 1.0454 2.3170 14.3429 34.3181 22.3808 22.5678 53.6757 2.7579 4.1931 3.6542 2.7342 2.9884 1.6361 1.9457 7.5946 29.1625 9.5769 54.4228 8.2328 0.5973 34.9075 0.5925 2.0096 48.1938 117.0929 19.7506 10.4098 198.7095 7.1009 15.3453 39.8162 7.0118 0.1772 10.0835 63.9905 19.9271 4.5864 2.0137 2.1653 1.1490 29.6774 5.0241 11.0822 189.8387 74.2453 169.3604 0.2922 7.8446 27.4057 19.7072 36.9467 6.6420 0.8260 30.4124 24.4038 5.3920 2.0784 1.4771 10.1522 18.3476 12.9230 53.0660 88.3576 45.9834 4.4978 12.4307 7.3082 4.8791 2.0725 22.9248 13.1735 14.5535 8.4280 18.1399 30.2742 27.2098 20.3533 14.9387 7.6881 69.2683 92.3149 421.7052 59.3636 75.5993 33.0554 5.4002 21.6048 21.4887 112.4474 44.6168 80.4704 30.4816 28.2518 58.6599 7.2610 46.7250 3.8126 8.6352 71.6441 5.6300 36.8641 7.6502 26.7016 47.7613 24.3099 8.4605 12.8641 7.3911 13.4561
temp: 298.150 k
press: 1.00000 atm
elementType: 8 8 8 8 7 6 6 6 6 6 6 6 6 6 6 6 6 6 6 6 6 6 6 6 1 1 1 1 1 1 1 1 1 1 1 1 1 1 1 1 1 1 1 1 1 1 1 1 1 1 1
symmnumber: 1
zpe: 1131600.8 jmol-1
zpe.correction: 0.431004 hartree
zpe.thermalcorrener: 0.454845 hartree
zpe.thermalcorrenthalpy: 0.455789 hartree
zpe.thermalcorrgfe: 0.376993 hartree
zpe.sumelectzpe: -1094.010638 hartree
zpe.sumelectthermal: -1093.986797 hartree
zpe.sumelectthermalent: -1093.985853 hartree
zpe.sumelectthermalfe: -1094.064649 hartree
dipole: -3.5501 1.5298 -2.2037
dipole: 4.4497
quadrupole: -125.2549 -137.3172 -145.2730
quadrupole: -6.0131 -12.1278 -0.6120
quadrupole: 10.6935 -1.3689 -9.3246 -6.0131 -12.1278 -0.6120
hfenergy: -1094.4416418 hartree
pointgroup: C01 [X(C19H27N1O4)]
dipole: -1.424406 -0.5458794 0.8589999 debye
polarizability: 260.2011483|15.7537913|215.0654474|9.4712449|-13.0304065|193.4526378 unknown
InChI: InChI=1S/C19H27NO4/c1-4-24-18(21)20-12-15-8-5-9-16(13-20)19(15,23-3)14-7-6-10-17(11-14)22-2/h6-7,10-11,15-16H,4-5,8-9,12-13H2,1-3H3
charge 0 multiplicity 1
51 atoms
O  -1.15799 2.661855 0.440433
O  3.568814 -1.510588 0.393911
O  3.642078 -0.788885 -1.843191
O  -3.656625 -2.475783 1.029443
N  1.772824 -0.357467 -0.48598
C  -0.584809 1.321363 0.092277
C  0.371361 1.627168 -1.10248
C  0.323459 0.778539 1.24188
C  1.388289 2.739067 -0.71942
C  1.304456 1.891186 1.706246
C  1.03848 0.313745 -1.580563
C  1.066034 -0.519182 0.802369
C  2.202253 2.435837 0.565201
C  -1.768488 0.410784 -0.299635
C  3.023557 -0.872146 -0.74409
C  -2.203993 -0.668255 0.499484
C  -2.528728 0.7340 -1.460328
C  -2.10266 2.678778 1.559599
C  -3.344788 -1.43103 0.142577
C  -3.66014 -0.024202 -1.812161
C  -4.081756 -1.120886 -1.023106
C  4.930235 -2.077015 0.191402
C  5.340931 -2.709602 1.518118
C  -4.820005 -3.30672 0.71158
H  -0.230189 2.003491 -1.951081
H  -0.299242 0.493898 2.114022
H  0.818405 3.673935 -0.573937
H  2.07834 2.901523 -1.570888
H  1.933664 1.496849 2.528707
H  0.711785 2.727073 2.122682
H  0.263666 -0.371944 -1.981817
H  1.760155 0.516185 -2.388647
H  1.805467 -0.796368 1.568875
H  0.346517 -1.357111 0.714299
H  3.007197 1.714138 0.342995
H  2.700527 3.364059 0.90694
H  -1.693846 -0.951282 1.424774
H  -2.248768 1.597368 -2.070786
H  -1.621695 2.392507 2.517828
H  -2.969225 2.013327 1.379492
H  -2.44947 3.722283 1.629833
H  -4.231783 0.238149 -2.709628
H  -4.962791 -1.699108 -1.316321
H  4.887665 -2.813885 -0.631112
H  5.612101 -1.263222 -0.115625
H  6.34982 -3.151807 1.425039
H  5.365272 -1.955765 2.324001
H  4.636847 -3.508228 1.808962
H  -4.69329 -3.822159 -0.26047
H  -5.75157 -2.707752 0.694465
H  -4.87195 -4.049615 1.520932
