program: Gaussian 09
title: 000040556
version: EM64L-G09RevD.01
frameworkgroup: C1[X(C11H15BrO)]
method: RPBEPBE
basis: SDD
operation: Freq
keyword: #p
keyword: freq=noraman
keyword: PBEPBE/SDD
title: #p freq=noraman PBEPBE/SDD
converged: YES YES NO NO
title: Mulliken charges:
elementType: Br O C C C C C C C C C C C H H H H H H H H H H H H H H H
charge: -0.031935 -0.270832 -0.092829 0.422747 -0.216918 -0.728587 -0.390282 -0.366343 -0.424462 -0.680939 -0.226603 -0.215357 -0.238330 0.221816 0.187476 0.198144 0.291710 0.294591 0.223080 0.210339 0.264434 0.235623 0.209957 0.224998 0.209131 0.229008 0.228937 0.231427
chargesum: 0.00000
title: Mulliken charges with hydrogens summed into heavy atoms:
elementType: Br O C C C C C C C C C C C
charge: -0.031935 -0.270832 0.128988 0.422747 0.168702 -0.142287 0.043137 -0.101909 -0.188839 -0.036853 0.002405 0.013580 -0.006903
polarizability: 1.82754753e+02 9.90142431e+00 1.14416720e+02 6.68680655e+00 -1.22345054e+01 1.10300056e+02
1716.lowfreq: -9.4263 -6.4816 -0.0006 -0.0005 -0.0002 6.6464 29.3661 34.3857 49.2563
frequency: 29.2200 34.2341 49.1553 57.7887 69.6310 110.7096 134.7081 171.3925 213.9590 224.5487 232.1702 274.7857 344.6340 404.3444 433.6790 503.7701 509.9480 580.9984 615.0550 649.7659 708.7952 762.9552 770.5585 796.1796 829.7232 861.1555 889.9560 900.0359 929.5888 954.4576 983.9835 989.3005 1000.9641 1017.5150 1028.1821 1054.4660 1071.7665 1080.7337 1128.6999 1144.6748 1166.7873 1172.7250 1182.0293 1197.8200 1225.0578 1228.9219 1278.6539 1279.9502 1299.9872 1318.8406 1338.2174 1380.8618 1389.7282 1396.8140 1424.7691 1440.3386 1474.3987 1478.2123 1480.1375 1482.3665 1492.1782 1593.6768 1609.8931 2927.6936 2950.3793 2976.2575 2980.4920 2999.9304 3048.3372 3061.8988 3077.2508 3080.0040 3114.1145 3126.6790 3138.3749 3149.4874 3151.8993 3164.6284
redmass: 3.7818 3.3988 1.7126 4.9975 5.1226 2.8546 3.0522 5.9274 1.5600 2.1065 3.7612 3.6351 3.6806 2.8441 3.9673 4.5007 3.0012 4.9892 6.4513 4.9787 1.7219 1.0992 1.9156 2.5074 3.0337 1.2449 1.1574 1.6836 1.4110 2.5883 1.4057 5.8695 1.3249 3.4661 2.3223 2.7544 2.5880 1.9647 1.8549 1.4458 1.6411 1.0824 1.1517 2.3116 1.2363 1.2123 1.1616 1.3140 1.2465 1.3413 1.3002 2.5170 1.8432 1.3895 1.1039 2.1143 1.0651 2.1883 1.0451 1.0752 1.0865 6.0863 6.0540 1.0558 1.0836 1.0361 1.1052 1.0603 1.1013 1.0564 1.1025 1.0988 1.0878 1.0860 1.0910 1.0968 1.1097 1.1014
irintensity: 0.2298 0.3016 0.3149 0.2740 0.0982 1.0739 1.1012 2.1951 3.4675 3.7768 1.2086 4.3547 0.0734 0.1347 2.3022 8.3774 11.3386 65.8526 0.0288 16.7688 64.7959 6.7929 31.6071 1.5580 0.1301 0.3327 3.0606 8.8536 1.8076 14.7542 0.1448 0.7789 0.3403 90.6655 35.4121 9.8275 52.3725 26.0632 3.0784 1.0259 2.0954 0.5899 3.8509 15.2494 4.2722 9.9897 1.9827 4.9466 6.7461 7.8948 13.8408 1.7325 7.6393 8.8974 10.9076 13.2651 3.5864 11.0963 11.9057 3.5754 11.8934 1.0525 1.0320 41.1526 35.8035 38.5190 34.5680 25.6701 0.4895 11.1422 78.7054 44.2586 7.4458 0.0417 11.3801 23.1630 9.4379 26.5681
temp: 298.150 k
press: 1.00000 atm
elementType: 35 8 6 6 6 6 6 6 6 6 6 6 6 1 1 1 1 1 1 1 1 1 1 1 1 1 1 1
symmnumber: 1
zpe: 609066.6 jmol-1
zpe.correction: 0.231981 hartree
zpe.thermalcorrener: 0.246113 hartree
zpe.thermalcorrenthalpy: 0.247058 hartree
zpe.thermalcorrgfe: 0.187544 hartree
zpe.sumelectzpe: -515.848662 hartree
zpe.sumelectthermal: -515.834530 hartree
zpe.sumelectthermalent: -515.833586 hartree
zpe.sumelectthermalfe: -515.893099 hartree
dipole: -3.4121 0.5971 0.8258
dipole: 3.5610
quadrupole: -88.6963 -85.3775 -83.8652
quadrupole: 4.9415 1.8188 -1.4637
quadrupole: -2.7167 0.6022 2.1145 4.9415 1.8188 -1.4637
hfenergy: -516.0806435 hartree
pointgroup: C01 [X(C11H15Br1O1)]
dipole: -0.9754273 0.9625191 0.291366 debye
polarizability: 169.5397512|-28.2256022|127.7710111|0.6025044|-14.8796686|110.1607674 unknown
InChI: InChI=1S/C11H15BrO/c1-2-8-13-11(9-12)10-6-4-3-5-7-10/h3-7,11H,2,8-9H2,1H3
charge 0 multiplicity 1
28 atoms
Br 2.043745 -3.455042 0.056763
O  1.488151 -0.191818 -0.301843
C  0.409868 -0.987281 0.28499
C  -0.966223 -0.332245 0.099665
C  1.838264 1.000192 0.491412
C  0.42197 -2.339623 -0.436834
C  3.013724 1.687114 -0.209977
C  -1.2650 0.376955 -1.090954
C  -1.962424 -0.460921 1.098475
C  3.489679 2.942011 0.554372
C  -2.543494 0.946612 -1.27894
C  -3.243223 0.106375 0.910182
C  -3.537133 0.810573 -0.280574
H  0.595292 -1.14723 1.370171
H  2.122282 0.687498 1.521024
H  0.964106 1.683159 0.56258
H  -0.443574 -2.957716 -0.157839
H  0.479083 -2.205502 -1.527695
H  3.839954 0.958323 -0.306558
H  2.705108 1.959161 -1.237176
H  -0.482188 0.492054 -1.849355
H  -1.735462 -0.999878 2.027521
H  3.828714 2.685791 1.575855
H  4.335382 3.422967 0.031441
H  2.680393 3.691082 0.644933
H  -2.765907 1.496745 -2.20026
H  -4.006159 0.005134 1.69017
H  -4.528729 1.253311 -0.426948
