program: Gaussian 09
title: 000040549
version: EM64L-G09RevD.01
frameworkgroup: C1[X(C15H8FNS)]
method: RPBEPBE
basis: SDD
operation: Freq
keyword: #p
keyword: freq=noraman
keyword: PBEPBE/SDD
title: #p freq=noraman PBEPBE/SDD
converged: NO YES NO NO
title: Mulliken charges:
elementType: S F N C C C C C C C C C C C C C C C H H H H H H H H
charge: 0.267500 -0.196051 -0.082114 0.452317 -0.115745 0.212274 0.581909 -0.019727 -0.379901 -0.752786 -0.393167 -0.338072 -0.331825 -0.444898 -0.243826 -0.387726 -0.224491 0.343947 0.276542 0.231379 0.292775 0.256847 0.275861 0.226846 0.263822 0.228310
chargesum: 0.00000
title: Mulliken charges with hydrogens summed into heavy atoms:
elementType: S F N C C C C C C C C C C C C C C C
charge: 0.267500 -0.196051 -0.082114 0.452317 -0.115745 0.212274 0.581909 -0.019727 -0.379901 -0.476244 -0.161788 -0.045298 -0.074978 -0.169038 -0.016980 -0.123904 0.003820 0.343947
polarizability: 3.58416951e+02 1.31845888e+01 1.98427363e+02 -2.55820728e-03 -6.40946774e-03 6.82640685e+01
1716.lowfreq: -0.0029 -0.0022 -0.0021 1.7826 2.7954 8.6475 50.9522 84.2668 128.4855
frequency: 50.9352 84.2652 128.4854 128.9091 174.3506 235.5127 252.1899 277.0125 290.3653 337.6322 366.7668 386.4138 398.6512 437.5816 451.5129 477.9040 523.5151 540.7877 564.1712 569.7157 617.3167 628.6751 667.5731 700.8088 743.5719 747.4912 768.3951 780.6559 798.1583 819.0601 837.8219 847.3994 860.4860 862.1901 879.0631 891.4081 948.6934 984.4271 986.8567 1010.2618 1019.6193 1074.4892 1093.4235 1124.2004 1160.1221 1174.8603 1184.4704 1222.3695 1244.1793 1260.3410 1281.6331 1334.8214 1365.5574 1391.2545 1410.9435 1425.9201 1445.7916 1462.0243 1516.8759 1561.6967 1580.6849 1606.1883 1616.8693 1626.1967 3122.5341 3134.7768 3154.3342 3160.9959 3164.8358 3167.4155 3167.9646 3182.7767
redmass: 7.8632 4.8690 6.8475 6.6497 5.1246 5.5415 7.9651 6.2400 10.4534 5.0996 11.2353 4.1135 9.1758 3.0949 6.4915 3.8137 8.0574 6.1574 4.1126 3.7056 7.8702 7.2404 7.7452 3.8413 2.5639 7.7339 1.9875 2.6164 6.4577 6.1509 1.5060 1.4171 1.5103 7.3433 1.5441 6.8955 1.4100 1.3271 1.3434 2.3176 3.1165 2.5194 2.0774 1.3627 1.2428 2.2570 2.8640 2.8789 1.9052 1.4758 1.5766 2.4669 6.0091 4.6954 4.9069 3.1638 3.4517 2.8317 6.1854 8.7764 6.8165 7.2191 7.9490 8.3306 1.0871 1.0895 1.0946 1.0893 1.0924 1.0931 1.0991 1.0974
irintensity: 0.4098 0.3562 3.9585 0.5520 0.6746 1.9304 1.7048 0.0062 1.4397 0.0105 1.5881 1.4050 6.5852 0.0555 3.3228 14.1407 3.5968 10.3461 4.0677 0.0767 3.7885 2.7568 0.5615 0.1397 27.0639 2.2033 32.7840 56.5437 4.1169 91.7484 22.8799 10.3620 50.9360 21.5843 6.6613 5.8484 3.3994 0.1729 1.0711 5.5610 3.6269 2.1190 3.5499 2.2723 6.5605 28.2489 88.2054 0.0820 3.6240 5.9442 2.4560 30.9756 7.8069 4.2298 45.5792 94.8275 98.7732 1.0693 29.6266 6.8486 9.8907 126.1884 29.9184 18.7872 3.0524 11.0369 27.3159 0.0942 0.8859 1.1592 31.8211 4.0292
temp: 298.150 k
press: 1.00000 atm
elementType: 16 9 7 6 6 6 6 6 6 6 6 6 6 6 6 6 6 6 1 1 1 1 1 1 1 1
symmnumber: 1
zpe: 481479.9 jmol-1
zpe.correction: 0.183386 hartree
zpe.thermalcorrener: 0.196419 hartree
zpe.thermalcorrenthalpy: 0.197363 hartree
zpe.thermalcorrgfe: 0.143611 hartree
zpe.sumelectzpe: -1127.853782 hartree
zpe.sumelectthermal: -1127.840749 hartree
zpe.sumelectthermalent: -1127.839805 hartree
zpe.sumelectthermalfe: -1127.893557 hartree
dipole: -1.1602 2.2004 0.0000
dipole: 2.4876
quadrupole: -106.3099 -98.1957 -115.3308
quadrupole: -2.6578 -0.0001 -0.0010
quadrupole: 0.3022 8.4165 -8.7187 -2.6578 -0.0001 -0.0010
hfenergy: -1128.0371675 hartree
pointgroup: C01 [X(C15H8F1N1S1)]
dipole: 0.4777701 -0.8541462 -0.000014 debye
dipolederiv: -0.6373696 -0.1654113 -0.000012 -0.0026598 -0.1536194 -0.0000113 -0.0000086 -0.0000183 0.091061 -1.4931893 0.1161445 0.0000133 0.0527447 -0.2100705 -0.0000037 0.0000416 -0.0000052 -0.1443838 -0.7740275 -0.3663327 -0.0000186 -0.424331 -0.4630672 -0.000017 0.0000018 -0.0000123 -0.2878041 0.0440385 0.0377856 0.0000052 -0.4869497 -0.5721733 -0.0000306 -0.000016 -0.0000267 0.0660364 0.1936801 0.0368997 -0.0000137 0.4760521 0.6246648 0.000027 0.0000402 0.00003 0.0598317 -0.0606376 0.1125126 0.0000035 0.2745502 -0.0302641 0.0000061 0.0000034 -0.0000004 -0.0053628 -0.0658399 -0.0295793 0.0000048 0.031513 -0.2197666 -0.0000132 -0.0000314 -0.0000176 0.0315925 0.7434674 0.2917524 0.0000308 -0.1802391 -0.0817808 -0.0000079 0.0000003 -0.0000009 0.0530089 0.2354922 -0.2911771 -0.0000199 -0.2235528 0.3769529 0.0000268 -0.0000082 0.0000346 -0.0813459 0.8474301 0.4055381 0.0000262 0.329172 0.2438345 0.0000186 0.0000128 0.0000045 -0.1835398 -0.0285521 -0.0745257 -0.0000029 -0.1214711 0.1194346 0.000015 -0.0000072 0.0000147 -0.1413366 0.0613495 -0.0052372 0.000001 -0.0300868 0.0464431 0.0000089 0.0000023 0.0000054 -0.0996853 -0.3002558 -0.1487922 -0.0000122 0.0610092 0.130577 0.0000093 -0.0000112 0.0000091 -0.1613249 -0.2905904 0.1285623 0.0000126 0.4191069 -0.1768883 -0.0000058 0.0000368 -0.000002 -0.1283087 -0.0106824 -0.0400615 0.0000017 -0.009997 0.0177693 0.0000094 0.0000038 0.0000082 -0.1738553 -0.330853 -0.0667931 0.0000002 -0.2148884 -0.0027917 0.0000092 -0.0000019 0.0000059 -0.1551925 0.1373974 0.1166439 0.0000093 0.0375183 -0.0547942 0.0000049 0.0000127 0.0000115 -0.1594566 1.5395948 -0.0859025 -0.0000206 -0.0340178 0.3871505 0.0000155 -0.0000623 0.0000172 0.0892276 0.00245 0.0710783 0.0000036 0.0328097 0.0423314 -0.0000037 0.0000009 0.0000006 0.1693948 0.0750315 -0.0247095 -0.0000024 0.0649015 -0.1050707 -0.0000135 0.0000049 -0.0000147 0.1507408 0.0940827 -0.0676032 -0.0000047 -0.0151865 0.0443646 -0.0000067 -0.0000063 -0.0000041 0.1528685 0.0965666 0.0300071 0.0000003 -0.0223618 -0.0686529 -0.0000089 -0.0000007 -0.0000063 0.167242 0.0977057 -0.0121945 -0.0000006 -0.0732344 0.0220536 -0.0000073 -0.0000031 -0.0000082 0.1860561 -0.1187434 0.074261 -0.0000003 0.0991412 0.0479331 -0.0000045 -0.0000009 -0.0000053 0.1652341 0.0455212 0.0595785 0.0000031 0.0734639 0.0079795 -0.000009 0.0000064 -0.00001 0.1805805 -0.1030668 -0.102444 -0.0000077 -0.1130066 0.0274508 -0.0000075 -0.0000098 -0.0000097 0.1587215 unknown
polarizability: 357.6655397|17.1314571|199.1787744|0.0023986|0.0064709|68.2640685 unknown
InChI: InChI=1S/C15H8FNS/c16-9-5-6-11-14(7-9)18-8-12-10-3-1-2-4-13(10)17-15(11)12/h1-8H
charge 0 multiplicity 1
26 atoms
S  -1.364012 -2.573762 -0.000122
F  -5.544057 0.436796 0.000068
N  0.903231 1.387268 0.000036
C  0.928444 -0.97198 -0.000034
C  0.130082 0.283159 0.000045
C  2.325098 -0.520899 0.000017
C  -1.325068 0.301645 0.000039
C  2.252427 0.917608 0.000079
C  -2.100209 -0.899189 -0.000022
C  0.391079 -2.232654 -0.000096
C  3.572531 -1.17639 -0.000005
C  -2.023471 1.547499 0.000091
C  3.423078 1.701529 0.00013
C  -3.516039 -0.860998 -0.000023
C  4.746689 -0.385232 0.000054
C  -3.422888 1.608472 0.000093
C  4.670755 1.034143 0.000119
C  -4.13959 0.391392 0.000032
H  0.991665 -3.147329 -0.000116
H  3.646967 -2.270309 -0.000068
H  -1.414723 2.456739 0.00014
H  3.355453 2.7937 0.000164
H  -4.120378 -1.77284 -0.000065
H  5.728369 -0.871515 0.000044
H  -3.960395 2.5605 0.000145
H  5.596863 1.620247 0.000156
