program: Gaussian 09
title: 000040546
version: EM64L-G09RevD.01
frameworkgroup: C1[X(C15H8FNS)]
method: RPBEPBE
basis: SDD
operation: Freq
keyword: #p
keyword: freq=noraman
keyword: PBEPBE/SDD
title: #p freq=noraman PBEPBE/SDD
converged: NO YES NO NO
title: Mulliken charges:
elementType: S F N C C C C C C C C C C C C C C C H H H H H H H H
charge: 0.271992 -0.197967 -0.080374 0.450205 -0.104114 0.210531 0.594030 -0.022065 -0.443839 -0.748739 -0.393003 -0.523127 -0.329896 -0.224059 -0.243161 0.347457 -0.224201 -0.386833 0.275198 0.231479 0.312127 0.257722 0.249858 0.226977 0.228638 0.265165
chargesum: 0.00000
title: Mulliken charges with hydrogens summed into heavy atoms:
elementType: S F N C C C C C C C C C C C C C C C
charge: 0.271992 -0.197967 -0.080374 0.450205 -0.104114 0.210531 0.594030 -0.022065 -0.443839 -0.473541 -0.161524 -0.211000 -0.072174 0.025799 -0.016184 0.347457 0.004437 -0.121668
polarizability: 3.52967253e+02 2.38759952e+01 2.05271259e+02 -6.42710827e-03 -7.92383904e-03 6.82742470e+01
1716.lowfreq: -0.0015 -0.0014 0.0022 2.9482 6.8827 8.4772 58.6294 82.0354 119.8162
frequency: 58.6278 82.0343 119.8142 125.8814 172.2980 238.6494 245.6883 315.0343 320.4248 324.3438 351.4097 372.4682 384.0473 434.9707 443.6540 473.0042 531.7459 568.9667 570.6804 586.7336 596.0823 624.6017 667.5765 703.5744 744.4558 747.3597 769.1107 784.2115 788.3664 807.6352 808.6441 845.1654 869.1225 879.2141 920.4233 922.9112 941.9004 949.3906 985.2863 1011.3718 1019.7673 1079.0318 1092.7863 1125.6544 1158.6195 1168.9949 1180.7161 1223.1637 1235.8348 1260.1895 1280.0178 1330.1164 1374.6905 1389.6628 1408.1386 1426.0651 1448.8394 1463.3429 1510.3944 1562.3701 1579.0245 1607.5620 1615.3919 1624.6644 3122.9229 3135.4465 3145.6327 3154.7433 3165.3030 3168.5365 3174.4386 3182.5138
redmass: 6.0771 4.8379 8.4843 7.0388 5.2900 5.0713 7.7361 6.9516 5.1277 8.2916 12.3991 4.3982 12.4795 3.0934 5.9997 3.2630 5.9703 3.7378 7.7071 4.3357 7.9659 7.9764 7.2693 4.0657 2.5532 7.9892 1.9210 3.1158 6.9114 6.6274 1.4024 1.4228 6.8722 1.5420 1.4980 4.6708 1.3370 1.4088 1.3267 2.1639 4.8158 2.1856 2.1302 1.4303 1.3697 2.3581 2.2475 2.8513 1.7286 1.6569 1.5432 2.2791 7.4714 4.7268 5.9518 2.8697 2.9576 2.9006 7.8125 7.5878 6.7153 7.9105 7.9190 8.1399 1.0871 1.0896 1.0902 1.0947 1.0924 1.0990 1.0930 1.0963
irintensity: 1.7304 0.6881 0.0216 0.3701 0.1401 3.1019 1.6391 1.2864 0.0320 0.9812 2.9010 0.0016 0.8210 1.1658 1.8198 18.3891 5.9962 0.1219 3.7744 2.9313 13.0656 6.6004 0.9877 5.4801 27.7660 2.1954 37.2151 36.7258 4.7966 45.8135 44.8441 21.7288 21.4754 3.8296 28.4299 21.7966 0.4976 3.0486 0.1857 11.6875 9.3043 2.7032 1.7317 21.6742 11.0876 51.6541 28.1263 0.0441 2.5496 11.3947 7.0922 23.9857 19.8190 2.8001 64.3953 35.9478 117.3510 4.8345 4.9514 26.5628 10.9973 30.9327 106.4932 7.6983 2.9071 11.1269 3.4743 27.3288 0.8872 31.3361 4.9350 1.8667
temp: 298.150 k
press: 1.00000 atm
elementType: 16 9 7 6 6 6 6 6 6 6 6 6 6 6 6 6 6 6 1 1 1 1 1 1 1 1
symmnumber: 1
zpe: 481505.6 jmol-1
zpe.correction: 0.183396 hartree
zpe.thermalcorrener: 0.196410 hartree
zpe.thermalcorrenthalpy: 0.197354 hartree
zpe.thermalcorrgfe: 0.143638 hartree
zpe.sumelectzpe: -1127.853865 hartree
zpe.sumelectthermal: -1127.840851 hartree
zpe.sumelectthermalent: -1127.839907 hartree
zpe.sumelectthermalfe: -1127.893623 hartree
dipole: -0.5070 3.9425 -0.0001
dipole: 3.9750
quadrupole: -93.9830 -105.4606 -115.3293
quadrupole: 6.0803 -0.0007 -0.0007
quadrupole: 10.9413 -0.5363 -10.4050 6.0803 -0.0007 -0.0007
hfenergy: -1128.0372612 hartree
pointgroup: C01 [X(C15H8F1N1S1)]
dipole: 0.2319333 -1.5465866 -0.0000387 debye
dipolederiv: -0.5930062 -0.2074895 -0.0000255 -0.1191637 -0.1710716 -0.0000155 -0.0000444 -0.0000431 0.0997845 -0.6809237 0.4055009 0.0000132 0.7322422 -0.7912241 -0.0000215 0.000026 -0.0000217 -0.1492411 -0.6121277 -0.3901737 -0.0000233 -0.3945715 -0.5332576 -0.0000248 -0.0000096 -0.0000227 -0.2839142 0.0826559 0.0767609 0.000003 -0.4903268 -0.6061542 -0.0000446 -0.0000283 -0.0000312 0.0652264 -0.0417746 0.0201475 -0.0000151 0.3948962 0.6565621 0.000034 0.000008 0.0000248 0.0567798 -0.0666878 0.1230386 0.0000033 0.2438481 0.0028075 0.0000114 0. 0.0000019 -0.0034837 0.2012464 -0.0865456 0.0000033 -0.0341533 -0.0216206 -0.0000063 -0.0000053 -0.0000172 0.0442537 0.6571863 0.3718161 0.0000476 -0.0959124 -0.071824 -0.0000096 0.0000274 0.0000106 0.0506134 -0.0594528 -0.3770251 -0.0000347 -0.2407657 0.2357885 0.0000228 -0.0000129 0.0000332 -0.1048658 0.7921233 0.4553638 0.0000593 0.4176907 0.3162282 0.0000319 0.0000596 0.0000386 -0.1819651 -0.0302407 -0.100124 -0.0000053 -0.1341879 0.1020951 0.0000149 -0.0000098 0.0000145 -0.1421706 -0.3905195 0.224223 0.0000053 0.0670998 -0.1275008 0.0000028 0.0000004 0.0000045 -0.1229136 -0.2566492 -0.1917581 -0.0000161 0.0409741 0.1208121 0.0000081 -0.0000153 0.0000014 -0.1584337 0.1701829 0.1502926 0.0000114 0.1586257 0.0184859 0.0000075 0.000019 0.0000103 -0.1046801 0.0006568 -0.0382427 0.000007 -0.0144226 0.0311269 0.0000101 0.0000192 0.0000075 -0.1719742 0.751044 -0.5424457 -0.0000175 -0.8129356 0.9136522 0.0000259 -0.0000245 0.0000234 0.0952009 0.110605 0.1421682 0.0000131 0.0660558 -0.0515629 0.0000064 0.0000113 0.0000143 -0.1598834 -0.1510226 -0.0176861 -0.0000044 0.2293561 -0.1174134 0.0000078 0.000008 0.0000043 -0.1613812 -0.0025922 0.0694259 -0.0000013 0.029924 0.0509128 -0.0000036 0.0000004 0.0000015 0.1676004 0.0701423 -0.0112795 -0.0000029 0.0794254 -0.100602 -0.0000138 0.000005 -0.000015 0.1510404 0.1179142 -0.0546699 -0.0000033 -0.0005021 0.0660308 -0.0000069 -0.0000037 -0.000005 0.1773504 0.0950492 0.0424166 0.0000003 -0.0101785 -0.0640092 -0.0000088 0. -0.0000037 0.1672105 0.0898249 -0.016985 0.0000002 -0.0862178 -0.0322431 -0.0000114 -0.0000038 -0.0000119 0.1610659 -0.1308362 0.0605495 -0.0000069 0.0846158 0.0609194 -0.0000027 -0.0000101 -0.0000036 0.1648443 -0.0851814 -0.1108048 -0.0000109 -0.1213733 0.0100307 -0.0000097 -0.0000133 -0.0000123 0.1589057 -0.0376168 0.003526 0. 0.0099574 0.1030313 -0.0000043 -0.0000034 -0.0000033 0.1850303 unknown
polarizability: 351.9024873|26.9479312|206.3360248|0.0062597|0.0080567|68.274247 unknown
InChI: InChI=1S/C15H8FNS/c16-9-5-6-14-11(7-9)15-12(8-18-14)10-3-1-2-4-13(10)17-15/h1-8H
charge 0 multiplicity 1
26 atoms
S  -1.221948 -2.807382 -0.000208
F  -4.357047 2.327301 0.000067
N  0.72368 1.320221 0.000026
C  0.934098 -1.029508 -0.000036
C  0.040613 0.157884 0.000001
C  2.290386 -0.469845 0.000033
C  -1.412113 0.062863 -0.000028
C  2.104849 0.959012 0.000098
C  -2.089035 -1.196793 -0.000099
C  0.498666 -2.330062 -0.000114
C  3.585799 -1.025177 0.000023
C  -2.199584 1.251683 0.000035
C  3.210379 1.832893 0.000162
C  -3.505106 -1.265141 -0.000098
C  4.693542 -0.143886 0.000105
C  -3.588739 1.149863 0.000028
C  4.50619 1.265458 0.000166
C  -4.271749 -0.087356 -0.000031
H  1.170695 -3.193516 -0.000119
H  3.746301 -2.109797 -0.000043
H  -1.687397 2.218063 0.000088
H  3.056973 2.916343 0.000192
H  -4.008061 -2.237837 -0.000154
H  5.710604 -0.551027 0.000123
H  5.383442 1.922426 0.000216
H  -5.36464 -0.115181 -0.000032
