program: Gaussian 09
title: 000040547
version: EM64L-G09RevD.01
frameworkgroup: C1[X(C16H10FNS)]
method: RPBEPBE
basis: SDD
operation: Freq
keyword: #p
keyword: freq=noraman
keyword: PBEPBE/SDD
title: #p freq=noraman PBEPBE/SDD
converged: NO YES NO NO
title: Mulliken charges:
elementType: S F N C C C C C C C C C C C C C C C C H H H H H H H H H H
charge: 0.220594 -0.202453 -0.056318 0.439390 -0.084735 0.504746 -0.878794 -0.388237 -0.480069 0.431928 -0.085653 -0.329538 -0.434348 -0.397117 -0.322073 -0.401334 0.344288 -0.249655 -0.224807 0.266984 0.292995 0.249494 0.283619 0.275215 0.236832 0.264180 0.258960 0.232021 0.233883
chargesum: 0.00000
title: Mulliken charges with hydrogens summed into heavy atoms:
elementType: S F N C C C C C C C C C C C C C C C C
charge: 0.220594 -0.202453 -0.056318 0.439390 -0.084735 0.504746 -0.318814 -0.388237 -0.230575 0.431928 -0.085653 -0.045919 -0.159133 -0.160285 -0.057892 -0.142374 0.344288 -0.017633 0.009076
polarizability: 3.47933057e+02 3.82893244e+00 2.09627613e+02 2.15078012e-02 -7.49631365e-01 8.39288158e+01
1716.lowfreq: -7.9479 -5.8049 -3.8622 -0.0016 -0.0013 -0.0005 46.9870 62.1278 98.5779
frequency: 46.9420 62.1250 98.5713 129.1390 160.4205 188.0991 232.9954 267.7636 279.9290 287.4093 323.3520 359.5515 401.8285 419.1350 431.6499 452.3590 480.0114 492.3762 509.3325 542.1143 557.1697 579.1110 612.8516 632.5901 668.3221 671.7604 708.1025 722.8537 753.6806 767.7338 792.9799 800.9311 827.9785 857.7918 863.2460 874.2881 884.2899 906.2007 937.4113 969.0155 969.4834 993.2330 996.1302 1016.7788 1048.3512 1121.4026 1123.8024 1150.8245 1159.9004 1170.5839 1182.1795 1222.6254 1243.4130 1250.3053 1254.0286 1295.0687 1305.9184 1358.6896 1368.4394 1388.5238 1406.2850 1424.1513 1437.5317 1446.3616 1474.2545 1490.1129 1547.5187 1576.0893 1595.0796 1603.6738 1624.7762 3016.5811 3100.5017 3120.9548 3123.5614 3138.5363 3156.5624 3163.8355 3171.1674 3172.1334 3184.4697
redmass: 6.5603 5.4535 5.9084 5.0078 4.8048 6.7156 6.0869 6.5767 3.4034 7.5370 6.9717 5.5111 8.7131 4.1764 5.3438 3.3444 2.9557 5.3228 7.5581 5.1492 4.6520 3.9261 7.2149 6.5206 5.4416 7.5559 5.0504 5.2469 3.5155 1.3709 4.6406 3.1096 1.5783 5.2631 1.5296 1.5272 3.0882 2.1433 1.6537 1.3906 1.3815 6.2381 1.3348 2.1669 2.4016 1.6403 1.4111 1.3847 1.1985 1.7324 2.1976 1.8475 1.7674 1.6109 1.3396 3.2391 2.2601 5.1363 5.6591 3.7026 3.3220 5.7318 1.2609 2.3994 3.3481 3.6145 7.4606 8.5583 6.6780 6.9115 6.7436 1.0610 1.1031 1.0919 1.0878 1.0891 1.0948 1.0886 1.0996 1.0929 1.0971
irintensity: 0.4125 0.4797 0.6037 3.1991 1.3513 1.0688 1.3731 1.0234 0.9042 2.2151 0.1749 0.0910 4.4713 0.7550 6.7134 9.1160 8.0710 0.3392 15.0289 0.8906 0.2571 4.0314 4.0067 6.4227 1.4333 1.4902 3.6713 1.0502 19.2612 53.6664 10.7925 25.0916 24.8189 41.4059 41.9693 9.4140 9.8533 2.3087 15.1908 5.1312 4.5061 11.6707 0.1195 10.5770 7.4665 4.6310 2.9688 19.6097 1.1042 24.4033 47.4266 7.0068 5.4173 15.1945 2.7319 38.5975 2.5127 18.7369 5.7346 24.4703 25.9871 63.6058 11.1772 11.7988 61.1782 32.5541 8.4276 42.4837 121.9724 45.2840 5.3770 20.8897 4.6277 5.3291 10.6517 10.6458 25.0784 0.1973 27.0375 0.5890 5.8390
temp: 298.150 k
press: 1.00000 atm
elementType: 16 9 7 6 6 6 6 6 6 6 6 6 6 6 6 6 6 6 6 1 1 1 1 1 1 1 1 1 1
symmnumber: 1
zpe: 557144.2 jmol-1
zpe.correction: 0.212205 hartree
zpe.thermalcorrener: 0.226303 hartree
zpe.thermalcorrenthalpy: 0.227247 hartree
zpe.thermalcorrgfe: 0.171003 hartree
zpe.sumelectzpe: -1167.098137 hartree
zpe.sumelectthermal: -1167.084039 hartree
zpe.sumelectthermalent: -1167.083095 hartree
zpe.sumelectthermalfe: -1167.139340 hartree
dipole: -3.8574 1.5843 1.2545
dipole: 4.3547
quadrupole: -112.5262 -104.2092 -120.4541
quadrupole: 0.0397 1.3708 2.0290
quadrupole: -0.1297 8.1873 -8.0576 0.0397 1.3708 2.0290
hfenergy: -1167.310342 hartree
pointgroup: C01 [X(C16H10F1N1S1)]
dipole: -1.5308046 -0.5913117 -0.4921624 debye
polarizability: 347.5363232|-7.9933233|209.8300168|2.994304|-4.641492|84.1231458 unknown
InChI: InChI=1S/C16H10FNS/c17-12-5-6-13-15(8-12)19-9-11-7-10-3-1-2-4-14(10)18-16(11)13/h1-8H,9H2
charge 0 multiplicity 1
29 atoms
S  1.94707 -2.55669 0.620011
F  5.538439 1.162584 0.18396
N  -0.838666 0.937499 -0.022946
C  -0.510316 -1.483548 -0.262805
C  -0.010651 -0.126819 -0.143598
C  1.45049 0.156761 -0.119825
C  0.446954 -2.615389 -0.536803
C  2.422411 -0.831295 0.224725
C  -1.886846 -1.696885 -0.186478
C  -2.788223 -0.59491 -0.038951
C  -2.205989 0.730236 0.016695
C  1.900579 1.483089 -0.370242
C  3.791751 -0.494957 0.332989
C  -4.209578 -0.740287 0.035759
C  -3.067803 1.867675 0.135276
C  3.257644 1.838285 -0.275869
C  4.17207 0.831468 0.083606
C  -5.028074 0.386285 0.154415
C  -4.452903 1.69731 0.202316
H  -0.019887 -3.60002 -0.375896
H  0.844438 -2.568681 -1.565948
H  -2.289985 -2.714478 -0.261458
H  1.1405 2.230075 -0.614919
H  4.54582 -1.243736 0.589902
H  -4.647609 -1.744936 -0.004109
H  -2.602302 2.857058 0.177168
H  3.605005 2.856972 -0.466389
H  -6.116014 0.272537 0.211152
H  -5.109327 2.569296 0.295564
