program: Gaussian 09
title: 000040543
version: EM64L-G09RevD.01
frameworkgroup: C1[X(C10H10Cl3NO2)]
method: RPBEPBE
basis: SDD
operation: Freq
keyword: #p
keyword: freq=noraman
keyword: PBEPBE/SDD
title: #p freq=noraman PBEPBE/SDD
converged: YES YES NO NO
title: Mulliken charges:
elementType: Cl Cl Cl O O N C C C C C C C C C C H H H H H H H H H H
charge: -0.041264 0.001571 0.002180 -0.311420 -0.271930 -0.459678 0.044460 -0.678511 -0.681652 0.668217 0.270960 -0.409998 -0.279461 -0.082483 -0.206216 -0.121799 0.236718 0.216101 0.253531 0.220548 0.212241 0.234093 0.223826 0.341484 0.335186 0.283296
chargesum: 0.00000
title: Mulliken charges with hydrogens summed into heavy atoms:
elementType: Cl Cl Cl O O N C C C C C C C C C C
charge: -0.041264 0.001571 0.002180 -0.311420 -0.271930 -0.118194 0.281177 0.011669 -0.011492 0.668217 0.270960 -0.409998 0.055725 -0.082483 0.077080 -0.121799
polarizability: 2.40866932e+02 -9.68056923e+00 1.66748290e+02 1.62247230e+00 1.56998433e+00 7.46245266e+01
1716.lowfreq: -7.5846 -4.9799 -0.6881 -0.0032 -0.0027 -0.0020 24.8485 33.4617 64.0992
frequency: 24.4922 33.3913 64.0968 65.4053 78.6689 106.9021 160.8291 161.6058 173.4896 181.9387 187.7387 234.0397 237.2727 238.6257 286.0371 312.0756 352.4503 359.8224 389.8463 432.0058 443.8884 460.1080 488.7103 526.4638 608.2893 651.0592 670.7811 695.7127 709.0311 722.1083 727.1253 805.8806 851.0570 895.6672 908.2141 909.7175 926.9417 940.9816 993.3180 1034.5278 1100.9951 1117.4601 1156.5153 1168.0962 1189.7682 1237.9159 1249.6631 1323.4773 1336.8639 1360.9958 1378.1237 1381.7582 1397.1704 1440.0452 1456.3212 1464.6890 1471.9375 1486.9986 1502.9212 1565.4801 1604.8500 1650.1428 2990.3586 2994.6499 3030.4461 3086.1937 3095.5390 3099.6422 3104.8625 3181.6704 3184.6220 3504.7814
redmass: 3.0936 5.7664 6.8593 8.0106 6.7487 8.0224 6.9470 5.2452 6.3688 2.5400 1.6547 5.0309 3.1404 1.5953 7.0758 23.2197 3.4130 9.2425 3.8462 3.7179 3.2530 4.1559 5.8027 6.9056 8.8686 7.6077 1.9232 4.9326 7.9424 5.3856 2.0757 4.9849 1.4142 2.8369 6.2217 1.3899 1.2185 1.3731 9.0936 4.6799 1.7993 1.9270 2.0986 2.7304 2.0368 1.2451 3.5674 1.4364 1.3251 4.8082 8.4215 1.2712 1.2280 2.5503 1.0541 1.0496 1.0542 1.0524 3.3789 4.9467 7.5860 7.6776 1.0356 1.0359 1.0867 1.0993 1.0988 1.1008 1.1007 1.0925 1.0935 1.0761
irintensity: 0.1141 0.3423 0.6373 1.2648 2.3299 2.3218 1.0527 1.8491 2.8566 0.2462 1.8557 0.3140 0.2664 0.7377 10.5655 0.3907 2.1059 0.6651 16.3155 1.5991 18.5479 8.6999 1.4268 27.6788 1.5449 39.3821 12.7430 2.7114 12.5765 4.6082 88.7395 4.6853 12.0883 9.8366 19.3950 38.7642 3.3378 0.8472 233.6888 71.0836 256.0214 12.9517 48.6342 475.6430 55.0793 37.7032 9.6270 8.8657 11.8485 122.2361 7.4864 32.3700 26.2125 56.9468 5.5113 5.3268 6.0613 16.3606 737.8841 77.6930 161.9609 162.5230 14.6297 22.3427 6.0102 7.1662 50.4592 17.2020 33.3631 26.9657 1.1000 61.0061
temp: 298.150 k
press: 1.00000 atm
elementType: 17 17 17 8 8 7 6 6 6 6 6 6 6 6 6 6 1 1 1 1 1 1 1 1 1 1
symmnumber: 1
zpe: 480691.1 jmol-1
zpe.correction: 0.183086 hartree
zpe.thermalcorrener: 0.199973 hartree
zpe.thermalcorrenthalpy: 0.200918 hartree
zpe.thermalcorrgfe: 0.136171 hartree
zpe.sumelectzpe: -1971.277938 hartree
zpe.sumelectthermal: -1971.261050 hartree
zpe.sumelectthermalent: -1971.260106 hartree
zpe.sumelectthermalfe: -1971.324852 hartree
dipole: -3.8712 1.8711 0.1443
dipole: 4.3021
quadrupole: -101.6723 -117.3682 -115.0260
quadrupole: 5.0953 0.1450 -0.3208
quadrupole: 9.6832 -6.0127 -3.6705 5.0953 0.1450 -0.3208
hfenergy: -1971.4610234 hartree
pointgroup: C01 [X(C10H10Cl3N1O2)]
dipole: -1.4753885 -0.8144946 -0.1569513 debye
dipolederiv: -0.2281844 -0.2081215 -0.0176065 -0.1928247 -0.6724595 -0.0363463 -0.0168719 -0.0383213 -0.0426812 -0.1611916 -0.1941997 -0.0156802 -0.2937507 -0.6372647 -0.0431458 -0.0191041 -0.036543 -0.0293825 -0.8415263 -0.0677004 -0.0395085 -0.0502246 -0.0665714 -0.0043855 -0.0353763 -0.004848 -0.0238047 -2.365988 0.0083254 -0.1744322 -0.3113618 -0.4607434 0.0184784 -0.0747295 0.0351872 -0.3652442 -0.852002 -0.0088912 -0.0422604 0.2146021 -0.8967166 -0.0282239 -0.0270239 -0.0304379 -0.3349088 -2.2941564 0.2625229 -0.1044006 0.6924155 -0.5181477 0.0302613 -0.0588624 -0.0009499 -0.3109064 1.2764073 -0.0795568 0.0803326 -0.4321813 0.2927863 -0.0936104 0.0175946 -0.0865311 0.4221587 -0.139927 -0.0192835 0.0027554 0.0889031 0.0133145 0.0875798 -0.0087265 0.1128367 -0.1473532 -0.1357945 -0.0493951 0.0259924 -0.0162803 0.0130028 0.0766998 0.049517 0.0671389 0.000692 1.5837882 -0.1418679 0.0726447 0.3032486 -0.1767186 0.0028543 0.0747476 -0.0226532 0.1338365 3.027831 -0.1908037 0.1899766 -0.505241 1.315803 0.0527781 0.101279 0.0453873 0.3146208 -0.0955994 0.2730033 0.0094388 0.4107307 0.962841 0.0666088 0.0203436 0.0628986 -0.126336 -0.3978836 0.0207656 -0.0165283 -0.28117 -0.2344738 -0.0206876 -0.0267912 -0.0048796 -0.1084143 0.1351301 0.2867191 0.0230589 0.3958484 1.024235 0.0707632 0.0262113 0.0620997 -0.0389288 -0.181027 0.0373909 -0.0042115 -0.1248683 -0.1515255 -0.0106295 -0.0118222 -0.0045634 -0.0213807 1.0406792 -0.0082211 0.0459306 0.0640007 -0.2076292 -0.0040608 0.0479401 -0.0064018 -0.0769871 -0.0132692 -0.0432383 -0.0430038 0.0713731 -0.0373045 -0.0644742 -0.0206715 -0.0559846 -0.0329545 -0.119273 0.1207438 -0.0246628 0.1400615 0.0455982 0.0085939 -0.0424942 -0.007178 0.0798841 0.010442 -0.1054689 0.0792237 -0.1125005 0.0384525 0.0461162 0.0794105 0.0277711 0.0536889 0.1192026 -0.0078744 -0.0162515 -0.0441465 -0.0596028 -0.1301449 -0.0161068 -0.0609845 -0.0036309 -0.134056 0.0794367 0.0073268 0.1091172 0.0214269 -0.000486 -0.0043344 0.010077 0.1120036 0.1148519 0.0074806 -0.0523183 -0.0227296 0.0616817 0.0786199 -0.0303836 0.0775383 -0.118565 0.1052052 -0.0043515 0.0128495 -0.0655532 -0.0465882 -0.0856904 -0.0201297 -0.1290255 0.0010689 0.2453397 -0.0022176 -0.0004579 -0.0584446 0.2425823 -0.0090772 -0.003629 -0.0031319 0.3120167 0.2261807 0.0083669 0.0045581 -0.0126628 0.0897088 -0.0037844 0.0021281 -0.0037285 0.1825531 0.0748204 0.0264363 -0.0027654 0.033639 0.0443126 -0.0046066 -0.0021144 -0.0047727 0.1689551 unknown
polarizability: 239.161064|13.3518676|167.9481806|9.1587208|2.7207487|75.1305042 unknown
InChI: InChI=1S/C10H10Cl3NO2/c1-5(2)16-10(15)14-9-4-7(12)6(11)3-8(9)13/h3-5,14H,1-2H3
charge 0 multiplicity 1
26 atoms
Cl 0.923457 -3.223889 -0.089315
Cl 3.246464 2.753853 0.286861
Cl 5.2890 0.165668 0.246882
O  -2.947398 -0.42616 -0.100784
O  -1.615729 1.515485 0.032369
N  -0.710449 -0.675718 -0.037954
C  -4.199206 0.418105 -0.150795
C  -4.42369 0.888972 -1.593806
C  -5.307893 -0.484202 0.393413
C  0.672778 -0.425376 0.03213
C  -1.737099 0.266059 -0.031726
C  1.580289 -1.520672 0.017446
C  1.22205 0.882131 0.116625
C  2.614942 1.062973 0.18165
C  2.969376 -1.345603 0.082339
C  3.495522 -0.039439 0.165192
H  -4.023175 1.286863 0.51038
H  -5.350404 1.488854 -1.651498
H  -3.586499 1.519755 -1.936686
H  -4.527556 0.02409 -2.272733
H  -6.262312 0.071668 0.419338
H  -5.073478 -0.823332 1.416714
H  -5.439531 -1.372344 -0.249233
H  -1.005474 -1.655568 -0.093629
H  0.545793 1.739372 0.131143
H  3.638821 -2.208746 0.068776
