program: Gaussian 09
title: 000040532
version: EM64L-G09RevD.01
frameworkgroup: C1[X(C12H12N)]
method: RPBEPBE
basis: SDD
operation: Freq
keyword: #p
keyword: freq=noraman
keyword: PBEPBE/SDD
title: #p freq=noraman PBEPBE/SDD
converged: NO NO NO NO
title: Mulliken charges:
elementType: N C C C C C C C C C C C C H H H H H H H H H H H H
charge: -0.098536 0.201546 0.282922 -0.270141 -0.180956 -0.585268 -0.361309 -0.361319 -0.137070 -0.144163 -0.203370 -0.203364 -0.213541 0.295352 0.283477 0.256665 0.256671 0.247743 0.293687 0.293673 0.288588 0.280892 0.258362 0.258361 0.261096
chargesum: 1.00000
title: Mulliken charges with hydrogens summed into heavy atoms:
elementType: N C C C C C C C C C C C C
charge: -0.098536 0.201546 0.282922 0.025212 0.102521 0.249836 -0.104644 -0.104648 0.151518 0.136729 0.054992 0.054998 0.047555
polarizability: 1.80169622e+02 3.78006497e+00 1.00990279e+02 -3.78993699e-03 2.04720465e-02 9.55322998e+01
1716.lowfreq: -50.6783 -9.7817 -4.8504 -0.0005 0.0001 0.0006 15.5995 79.4572 84.7120
frequency: -50.0295 79.4545 84.7002 100.0207 182.6499 267.8786 290.5823 302.2633 391.3694 421.1437 440.3101 520.7120 537.5835 563.7286 611.6667 627.6275 707.0235 722.3649 755.0863 769.5259 783.2948 792.9255 858.9576 901.2649 937.4700 973.2284 985.1503 986.7324 1004.8148 1015.3436 1021.7615 1034.2782 1047.4749 1061.6136 1085.7371 1120.7667 1144.1009 1173.0436 1185.0150 1188.4519 1195.8291 1285.8175 1304.3569 1317.0803 1328.4169 1369.3990 1413.9165 1429.9150 1450.4429 1460.8148 1462.9105 1479.5300 1504.7399 1563.5854 1580.5451 1601.5956 1617.8754 3029.7869 3131.7653 3132.4729 3136.8365 3145.1982 3152.9015 3164.9370 3172.6551 3179.5732 3189.6930 3196.9076 3207.8527
redmass: 3.3684 3.9326 4.1220 1.1072 2.8622 4.2188 4.6940 3.7403 2.8332 3.0719 3.1428 4.3351 3.1033 4.3373 6.2005 6.8499 1.9200 5.4483 4.2886 1.7686 1.2395 4.8241 1.2394 1.3307 1.3480 1.3696 6.1894 1.3826 5.6250 1.3380 1.3688 2.3236 1.7755 2.0823 1.6329 1.3640 1.6820 2.4929 1.0550 1.1236 1.1181 2.4297 1.7940 1.3863 4.0747 6.4721 1.4941 2.1433 1.5434 1.0428 1.3789 1.5671 2.1398 5.8270 5.7381 5.8652 5.8490 1.0331 1.0902 1.0896 1.1034 1.1044 1.0904 1.0957 1.0913 1.1015 1.0921 1.0970 1.1018
irintensity: 0.2051 0.2673 0.5582 1.0689 2.2490 3.0306 1.5214 0.4823 0.0010 2.2779 5.5436 10.7117 8.1339 4.0132 0.4414 2.0566 47.7242 0.6992 0.0666 53.1795 77.7967 5.0468 0.0103 0.4375 1.5634 0.2634 8.2282 0.0085 6.2127 0.0695 0.2399 3.0954 0.1083 0.9311 6.6305 2.3094 12.9107 15.1222 0.0021 0.2887 1.2387 4.3379 7.7266 0.8354 6.7316 0.4735 11.8688 12.2089 22.2749 33.0975 3.3965 26.0936 78.7310 41.5875 2.2905 1.4961 62.0704 1.8948 1.9891 1.9751 0.8271 5.4596 1.4015 7.2868 0.5265 5.6077 0.1999 2.0001 1.1861
temp: 298.150 k
press: 1.00000 atm
elementType: 7 6 6 6 6 6 6 6 6 6 6 6 6 1 1 1 1 1 1 1 1 1 1 1 1
symmnumber: 1
zpe: 543609.8 jmol-1
zpe.correction: 0.207050 hartree
zpe.thermalcorrener: 0.217107 hartree
zpe.thermalcorrenthalpy: 0.218051 hartree
zpe.thermalcorrgfe: 0.171118 hartree
zpe.sumelectzpe: -518.085813 hartree
zpe.sumelectthermal: -518.075757 hartree
zpe.sumelectthermalent: -518.074812 hartree
zpe.sumelectthermalfe: -518.121745 hartree
dipole: -4.8374 1.3375 -0.0007
dipole: 5.0189
quadrupole: -32.1586 -59.7431 -68.3917
quadrupole: -0.0681 -0.0009 0.0023
quadrupole: 21.2725 -6.3120 -14.9605 -0.0681 -0.0009 0.0023
hfenergy: -518.2928635 hartree
pointgroup: C01 [X(C12H12N1)]
dipole: 1.8928764 -0.5621348 -0.0002702 debye
dipolederiv: -0.2931754 -0.1488225 -0.0000739 -0.0141182 -0.2504002 -0.0000959 -0.0000965 -0.0000553 -0.0229275 1.0175287 -0.1039316 -0.0000688 0.2349156 0.1839927 0.0001203 0.0001215 0.0000797 0.0162058 -0.2381198 0.0020611 0.0000151 -0.0224933 -0.1060417 -0.0001271 -0.0000631 -0.0001161 0.0303476 -0.5723138 -0.0916992 -0.0000585 -0.3440196 0.051224 0.0000554 0.0000552 0.0000609 -0.0650115 -0.012282 0.2329075 0.0001172 -0.1210513 0.2235897 0.0000683 -0.0000977 0.0000516 -0.0136577 0.1209305 0.0403373 0.0000292 0.0760011 0.300657 0.0001258 -0.000086 0.0001101 0.0927037 -0.0563293 0.0074315 -0.1034776 0.0143543 -0.1211574 -0.0133126 0.1807434 -0.0114602 0.0304415 -0.0563895 0.0072601 0.1034646 0.0153863 -0.1212463 0.0130106 -0.1807139 0.0111685 0.0304679 0.2892584 0.041372 0.0000143 -0.0195512 0.2694661 0.000118 0.0000529 0.0001102 -0.0262401 0.1396957 -0.0505019 -0.0000073 0.2055126 -0.3491294 -0.0001166 0.0001223 -0.0000997 -0.0846824 -0.0598336 0.0003916 0.1298496 0.0055054 -0.1139531 -0.0057756 0.0710495 -0.0029099 0.0766668 -0.0598189 0.000628 -0.1298295 0.005559 -0.1139625 0.0054386 -0.0710156 0.0025413 0.0766884 0.1905319 0.0037264 0.0000031 0.0002898 -0.1151932 -0.0000759 -0.0000098 -0.0000746 -0.043808 0.0927729 0.0414191 0.0000074 0.0606278 0.0858348 -0.0000284 0.0000208 -0.0000192 0.1436023 0.1008629 -0.0085262 -0.0000018 0.0110645 0.0402431 -0.000045 -0.0000356 -0.0000307 0.1661849 0.0511285 -0.0046381 0.0881007 -0.0092919 0.1450445 0.0032255 0.080012 -0.0009465 -0.0006567 0.0511089 -0.0044471 -0.0881145 -0.0091614 0.1450505 -0.0029187 -0.0800388 0.0012387 -0.000673 -0.0441705 0.1241432 0.000054 0.0180235 0.0467239 -0.0000548 0.0000121 -0.0000571 0.1422332 0.0970879 -0.0338259 0.0622731 -0.0391009 0.0780412 -0.0615911 0.0762231 -0.0150078 0.02599 0.0971375 -0.0337432 -0.0622894 -0.0390924 0.0779306 0.0616476 -0.0761938 0.0150757 0.026058 0.0794418 -0.0362353 -0.0000172 -0.0376748 0.051968 -0.0000411 -0.000061 -0.0000398 0.1538428 0.0469447 0.0133482 -0.0000012 0.0170498 0.1099436 -0.0000238 -0.0000031 -0.0000164 0.1709953 0.0374031 0.001156 -0.0559409 -0.0023254 0.1592036 0.0003353 -0.061244 0.001347 -0.0122946 0.0373965 0.0010489 0.0559523 -0.0025138 0.1592052 0.0000008 0.0612381 -0.0010114 -0.0122979 -0.0567968 -0.0008599 -0.0000001 -0.0038955 0.1629651 0.0000601 0.0000078 0.0000611 0.0998209 unknown
polarizability: 180.2842898|2.2795683|100.8756117|0.0034019|-0.0205401|95.5322998 unknown
InChI: InChI=1S/C12H12N/c1-13-10-6-5-9-12(13)11-7-3-2-4-8-11/h2-10H,1H3
charge 1 multiplicity 1
25 atoms
N  1.413607 -0.977544 -0.000471
C  0.68882 0.208174 0.000008
C  -0.804297 0.162186 -0.000036
C  1.399152 1.42886 0.000504
C  2.791934 -0.979079 -0.000401
C  0.68601 -2.287115 -0.001204
C  -1.514246 0.160388 -1.229979
C  -1.514249 0.157888 1.229934
C  2.810984 1.44665 0.000558
C  3.515518 0.219571 0.000126
C  -2.926927 0.147854 -1.225111
C  -2.926902 0.14541 1.22503
C  -3.634392 0.136575 -0.000058
H  0.823818 2.357199 0.000895
H  3.2842 -1.953444 -0.000709
H  -0.973995 0.186136 -2.18389
H  -0.973982 0.181733 2.183883
H  1.418865 -3.107353 -0.001619
H  0.051248 -2.360049 0.894666
H  0.051344 -2.359034 -0.897226
H  3.351869 2.397658 0.00094
H  4.60715 0.184791 0.000177
H  -3.471499 0.154883 -2.17458
H  -3.471516 0.150583 2.174487
H  -4.729114 0.130579 -0.000027
