program: Gaussian 09
title: 000040540
version: EM64L-G09RevD.01
frameworkgroup: C1[X(C9H18O4)]
method: RPBEPBE
basis: SDD
operation: Freq
keyword: #pfreq=noraman
keyword: PBEPBE/SDD
title: #p freq=noraman PBEPBE/SDD
converged: YES YES NO NO
title: Mulliken charges:
elementType: O O O O C C C C C C C C C H H H H H H H H H H H H H H H H H H
charge: -0.281255 -0.353976 -0.278004 -0.489706 -0.045944 -0.470914 -0.465239 -0.292004 -0.272999 -0.192387 -0.320285 -0.281877 -0.303001 0.227749 0.281465 0.204953 0.229356 0.229226 0.194825 0.220536 0.210947 0.220232 0.191104 0.215576 0.210806 0.217782 0.206931 0.196953 0.200521 0.189603 0.399027
chargesum: 0.00000
title: Mulliken charges with hydrogens summed into heavy atoms:
elementType: O O O O C C C C C C C C C
charge: -0.281255 -0.353976 -0.278004 -0.090679 0.181805 0.015504 -0.006657 0.123357 0.158181 0.214293 0.108303 0.122007 0.087122
polarizability: 1.31831889e+02 9.05003538e-01 1.12394334e+02 1.73676651e+00 1.76411032e+00 8.76157333e+01
1716.lowfreq: -7.0281 -4.3680 -0.0009 -0.0009 -0.0005 4.9096 28.0733 45.1807 52.9103
frequency: 26.7878 43.2972 52.8187 73.4515 89.5779 108.0327 117.3236 170.6513 200.5054 220.6635 248.8537 292.5496 307.7486 358.2508 381.8778 445.1161 483.6503 528.5412 570.9691 646.4495 741.1944 806.2201 822.1857 852.8651 854.6405 863.7753 865.5541 895.2575 899.0889 921.4121 971.3541 990.9496 995.3546 1028.1534 1033.2416 1040.1721 1051.4081 1065.5119 1091.7707 1115.3996 1119.3709 1136.3375 1155.2770 1168.4361 1197.1362 1200.6454 1220.9965 1230.5848 1260.6942 1264.4808 1275.3554 1296.5531 1312.7549 1328.4500 1336.3824 1347.5927 1359.6663 1365.7105 1372.8492 1396.0681 1423.3786 1439.0499 1448.3943 1453.7487 1459.1757 1467.0039 1474.7789 1482.7468 1491.9449 2942.6389 2949.9209 2955.4855 2965.9121 2971.1306 2972.0739 2982.8012 2997.6296 3009.6135 3012.6945 3023.2861 3037.4632 3041.3881 3052.6596 3061.7197 3079.3938 3090.7544 3215.0025
redmass: 4.2364 3.0062 3.1054 4.5963 3.7765 3.8413 3.7858 3.9508 3.7076 1.7748 2.7653 3.7922 3.1578 3.0524 3.0669 2.1686 2.0948 2.6332 2.0846 4.0539 3.2021 3.1807 1.3865 2.3477 1.7990 2.0322 2.0655 2.1489 1.8338 2.4879 1.4450 2.0421 4.5634 2.7792 2.5952 3.6047 2.1532 4.3918 2.9711 2.2701 1.5558 1.6517 1.6944 1.4543 1.0939 1.3425 1.1415 1.2836 1.1172 1.1258 1.1666 1.2807 1.2804 1.2649 1.2827 1.2397 1.2715 1.4613 1.2692 1.5291 1.1263 1.0826 1.1024 1.0834 1.0872 1.0917 1.0905 1.0825 1.0946 1.0571 1.0649 1.0567 1.0591 1.0654 1.0602 1.0841 1.0670 1.1040 1.0623 1.1065 1.1049 1.0983 1.1029 1.0986 1.1010 1.1049 1.0698
irintensity: 1.3222 0.9756 1.4271 6.3052 10.7750 0.9613 4.4370 11.8472 5.6801 1.5640 2.9295 0.2997 1.6605 6.5234 7.7434 5.0964 14.6295 1.4887 2.0764 4.7724 3.3819 18.8196 70.1430 2.2079 29.5599 5.7937 48.6062 21.8194 3.4104 15.0274 7.1297 20.8449 131.0542 19.4850 22.3673 9.7154 60.0455 176.1441 41.1870 25.3394 2.7451 10.4921 2.4210 5.2224 7.7375 5.8260 4.3323 3.8209 14.6409 12.9727 7.7090 7.0614 1.2025 11.3224 6.6139 11.2312 2.5863 1.8066 2.1073 1.7687 22.6713 11.9491 1.8793 12.0104 7.8138 12.0884 13.3918 6.6902 3.1735 38.8266 62.7745 50.5466 49.1710 133.5157 50.9824 16.8719 17.4391 57.2998 25.7777 54.7172 36.9133 82.7642 56.5341 41.5599 11.1102 50.4534 478.7920
temp: 298.150 k
press: 1.00000 atm
elementType: 8 8 8 8 6 6 6 6 6 6 6 6 6 1 1 1 1 1 1 1 1 1 1 1 1 1 1 1 1 1 1
symmnumber: 1
zpe: 700531.7 jmol-1
zpe.correction: 0.266818 hartree
zpe.thermalcorrener: 0.281203 hartree
zpe.thermalcorrenthalpy: 0.282148 hartree
zpe.thermalcorrgfe: 0.223644 hartree
zpe.sumelectzpe: -653.513390 hartree
zpe.sumelectthermal: -653.499005 hartree
zpe.sumelectthermalent: -653.498061 hartree
zpe.sumelectthermalfe: -653.556565 hartree
dipole: -0.0496 -0.5770 1.0959
dipole: 1.2395
quadrupole: -76.7362 -76.2353 -81.8110
quadrupole: 7.2794 4.8386 3.9714
quadrupole: 1.5246 2.0256 -3.5501 7.2794 4.8386 3.9714
hfenergy: -653.7802089 hartree
pointgroup: C01 [X(C9H18O4)]
dipole: 0.0232402 -0.189891 0.4485701 debye
polarizability: 130.1598794|5.4777069|114.1524069|2.081079|0.1778378|87.5296699 unknown
InChI: InChI=1S/C9H18O4/c10-3-5-11-6-7-12-8-9-2-1-4-13-9/h9-10H,1-8H2
charge 0 multiplicity 1
31 atoms
O  3.324628 -0.238036 -0.068103
O  -0.276572 -1.125449 -0.193734
O  -3.212568 -1.092792 0.710846
O  -1.693251 1.003366 -1.041402
C  1.883189 -0.029488 -0.396517
C  1.522904 1.381022 0.120579
C  2.873212 2.134342 0.011188
C  3.888226 1.048848 0.422634
C  1.125431 -1.193452 0.249855
C  -1.091553 -2.267106 0.246419
C  -2.541244 -2.045916 -0.18344
C  -3.746118 0.132829 0.086876
C  -2.702713 1.256262 -0.017712
H  1.769504 -0.085225 -1.497831
H  0.709461 1.84399 -0.461662
H  1.201046 1.324225 1.178682
H  2.918428 3.025612 0.660147
H  3.049571 2.453687 -1.032102
H  4.000968 0.997115 1.524812
H  4.883342 1.170502 -0.038751
H  1.180266 -1.126517 1.356662
H  1.57116 -2.156084 -0.07448
H  -0.69267 -3.196507 -0.215876
H  -1.043755 -2.363004 1.350946
H  -3.078708 -3.01221 -0.101557
H  -2.576804 -1.706848 -1.237561
H  -4.573676 0.445746 0.750901
H  -4.15542 -0.089329 -0.920745
H  -3.212594 2.19144 -0.317354
H  -2.242583 1.4123 0.982387
H  -1.107505 0.238076 -0.743808
