program: Gaussian 09
title: 000040522
version: EM64L-G09RevD.01
frameworkgroup: C1[X(C9H17NO2)]
method: RPBEPBE
basis: SDD
operation: Freq
keyword: #p
keyword: freq=noraman
keyword: PBEPBE/SDD
title: #p freq=noraman PBEPBE/SDD
converged: YES YES NO NO
title: Mulliken charges:
elementType: O O N C C C C C C C C C H H H H H H H H H H H H H H H H H
charge: -0.287983 -0.251569 -0.064920 0.052107 -0.432824 -0.402766 -0.460906 -0.385847 -0.355216 -0.626931 0.283863 -0.758426 0.258977 0.209194 0.240612 0.193094 0.209027 0.194663 0.226405 0.213472 0.194063 0.207955 0.167098 0.226717 0.189721 0.225598 0.245164 0.245349 0.244311
chargesum: 0.00000
title: Mulliken charges with hydrogens summed into heavy atoms:
elementType: O O N C C C C C C C C C
charge: -0.287983 -0.251569 -0.064920 0.311084 0.016982 -0.000644 -0.039838 0.021688 0.019836 0.015105 0.283863 -0.023603
polarizability: 1.30298439e+02 -1.15802975e+00 1.05105904e+02 -6.12193532e-01 3.37574931e+00 9.13450439e+01
1716.lowfreq: -38.2193 -13.7014 -10.6673 -0.0009 -0.0009 -0.0005 16.0745 45.1303 56.5470
frequency: -38.0742 45.0460 56.4529 86.3758 118.6400 134.4877 197.1724 219.7110 246.8398 264.9823 309.3343 335.6979 368.3108 379.1894 416.9832 455.0651 497.4122 517.7427 567.9817 634.8359 732.2141 770.5560 839.6748 842.5201 886.8715 916.7642 934.0826 959.8520 976.2888 997.3584 1027.2999 1040.1623 1047.0992 1093.2251 1105.3810 1108.9420 1126.6419 1166.5303 1185.0954 1200.4413 1211.8245 1222.1669 1238.4159 1282.1013 1290.4057 1304.7174 1327.8105 1341.7428 1346.4935 1358.3470 1371.7022 1376.4097 1382.3781 1432.5352 1453.3181 1455.1562 1459.5059 1461.2880 1463.9590 1469.3740 1475.8618 1484.3999 1484.8343 1645.6181 2812.3413 2855.2752 2872.6695 2970.2251 2983.0738 2992.5771 3007.0768 3010.7006 3018.6371 3027.8675 3041.5276 3043.9778 3047.8840 3063.8152 3077.8537 3095.4766 3141.7051
redmass: 1.0763 7.0083 3.0303 2.8503 2.9413 1.9131 3.1158 1.6035 2.5103 2.2356 2.2544 2.9874 2.4196 3.0362 2.7248 2.5939 1.8588 3.4992 3.1359 4.4737 2.2900 2.0236 3.2300 2.5235 1.8487 3.2936 2.3464 2.5242 2.1784 1.9511 1.7249 1.6630 1.8504 1.9260 1.3373 2.6208 2.0811 1.8886 1.5417 1.7075 2.4394 1.4425 1.4594 1.4198 1.3251 1.2790 1.2745 1.4154 1.4311 1.4120 1.3490 1.3956 1.2813 1.1659 1.0640 1.0474 1.0773 1.0821 1.0606 1.0811 1.0921 1.0638 1.0809 9.2715 1.0711 1.0602 1.0672 1.0619 1.0637 1.0621 1.0366 1.0863 1.0728 1.0961 1.0920 1.0970 1.0902 1.0984 1.1007 1.0974 1.1010
irintensity: 1.2523 0.8569 0.1978 2.8365 2.7602 0.4133 3.8837 0.6807 1.4405 3.0953 6.1074 2.3781 5.0991 3.7775 3.6041 0.8504 2.5259 5.5208 3.0395 4.5513 12.3986 4.2248 4.9899 6.4639 19.8096 14.7305 35.8452 14.9653 13.9030 105.5289 2.6707 8.4488 22.9081 8.5717 8.9999 23.6193 23.8590 6.1282 13.0342 141.4817 197.3579 9.4670 0.3732 5.8449 30.7573 2.1833 0.8611 3.6228 0.6401 3.7677 9.3178 5.8605 45.4744 1.0562 26.0591 17.7220 2.3687 14.5775 29.7304 1.0736 15.1485 10.2489 11.4661 182.0681 89.7328 95.0014 151.7243 31.2302 18.9949 28.0847 3.9205 55.5775 50.7073 36.3420 26.8794 29.0068 18.1840 39.7972 37.9071 9.0637 11.7887
temp: 298.150 k
press: 1.00000 atm
elementType: 8 8 7 6 6 6 6 6 6 6 6 6 1 1 1 1 1 1 1 1 1 1 1 1 1 1 1 1 1
symmnumber: 1
zpe: 659216.0 jmol-1
zpe.correction: 0.251082 hartree
zpe.thermalcorrener: 0.263579 hartree
zpe.thermalcorrenthalpy: 0.264523 hartree
zpe.thermalcorrgfe: 0.211959 hartree
zpe.sumelectzpe: -557.366760 hartree
zpe.sumelectthermal: -557.354263 hartree
zpe.sumelectthermalent: -557.353319 hartree
zpe.sumelectthermalfe: -557.405884 hartree
dipole: -1.4069 -0.7469 -2.2109
dipole: 2.7249
quadrupole: -67.4511 -70.5832 -78.7334
quadrupole: -3.7133 -5.3774 -1.6063
quadrupole: 4.8048 1.6727 -6.4775 -3.7133 -5.3774 -1.6063
hfenergy: -557.6178421 hartree
pointgroup: C01 [X(C9H17N1O2)]
dipole: -0.5838911 -0.2582039 -0.8612179 debye
polarizability: 130.0252026|-2.7194632|105.3646429|-0.954289|3.4376537|91.3595416 unknown
InChI: InChI=1S/C9H17NO2/c1-8(11)12-9-5-3-4-6-10(2)7-9/h9H,3-7H2,1-2H3
charge 0 multiplicity 1
29 atoms
O  1.614925 -0.527386 -0.617169
O  2.746331 0.38834 1.210696
N  -1.96148 -0.856738 0.252783
C  0.321241 0.07872 -0.13101
C  0.274846 1.549469 -0.595108
C  -1.15224 2.159344 -0.637446
C  -0.795075 -0.840455 -0.664318
C  -2.113975 1.686691 0.483822
C  -2.82509 0.346484 0.184963
C  -2.758229 -2.095515 0.123391
C  2.753536 -0.291162 0.158537
C  3.958654 -0.972196 -0.457585
H  0.320581 0.015572 0.97192
H  0.722134 1.606602 -1.606851
H  0.921887 2.139036 0.080008
H  -1.627874 1.933003 -1.613448
H  -1.05059 3.260795 -0.595926
H  -1.072912 -0.558869 -1.710907
H  -0.380557 -1.863581 -0.702082
H  -1.587937 1.619359 1.455594
H  -2.910148 2.447468 0.605996
H  -3.635106 0.200625 0.92599
H  -3.319007 0.434182 -0.821189
H  -2.110175 -2.975804 0.280221
H  -3.259054 -2.206158 -0.871943
H  -3.545119 -2.110065 0.899126
H  4.14685 -0.568436 -1.467704
H  3.771149 -2.054294 -0.566573
H  4.841333 -0.808431 0.177113
