program: Gaussian 09
title: 000040558
version: EM64L-G09RevD.01
frameworkgroup: C1[X(C6H12N6O4)]
method: RPBEPBE
basis: SDD
operation: Freq
keyword: #p
keyword: freq=noraman
keyword: PBEPBE/SDD
title: #p freq=noraman PBEPBE/SDD
converged: YES YES NO NO
title: Mulliken charges:
elementType: O O O O N N N N N N C C C C C C H H H H H H H H H H H H
charge: -0.489186 -0.466684 -0.454313 -0.451711 -0.078868 -0.097743 0.044098 -0.019805 -0.059320 -0.039624 -0.122248 -0.182386 -0.083459 -0.132932 -0.438705 -0.419278 0.239174 0.316900 0.198947 0.273533 0.231960 0.241840 0.264539 0.256676 0.358447 0.372532 0.370656 0.366959
chargesum: 0.00000
title: Mulliken charges with hydrogens summed into heavy atoms:
elementType: O O O O N N N N N N C C C C C C
charge: -0.130739 -0.094151 -0.083656 -0.084752 -0.078868 -0.097743 0.044098 -0.019805 -0.059320 -0.039624 0.116926 0.134514 0.115488 0.140601 0.035094 0.101937
polarizability: 1.28864670e+02 2.45805797e+01 1.42460970e+02 -7.99899434e+00 -1.69154283e+01 9.97019197e+01
1716.lowfreq: -13.5880 -10.2535 -0.0009 -0.0007 -0.0006 3.5943 11.1231 27.7555 35.2426
frequency: 4.9692 27.6903 35.2301 52.7847 71.8330 83.3790 101.4009 151.5636 157.9866 176.6862 218.1392 234.4001 240.9308 269.3967 281.9581 290.5976 309.8838 347.1928 391.9778 453.3308 477.5738 481.6847 484.9449 490.0899 516.5782 571.2214 583.9621 602.5558 688.5217 729.5231 771.9523 802.0113 823.4578 860.1861 897.3001 905.4196 920.5667 950.0346 973.9587 1010.3709 1033.4150 1057.2159 1088.4526 1095.4910 1146.1514 1186.7400 1225.0880 1238.3725 1242.0245 1255.1948 1259.7771 1272.9362 1285.9893 1300.3853 1324.9378 1333.8624 1359.0251 1362.6028 1367.8196 1384.0430 1392.0576 1425.8447 1446.5513 1452.1311 2042.2694 2057.5002 2914.3582 2988.5853 3004.5266 3023.0376 3055.8019 3061.5651 3081.6887 3082.2649 3297.9896 3432.6396 3473.8801 3599.1145
redmass: 6.6032 11.7590 8.1321 8.7681 5.3371 8.5517 7.8160 4.8676 4.5474 5.9714 5.8662 4.7514 2.2460 3.1343 3.9114 3.2542 4.6600 3.0104 2.6290 4.6723 1.3196 8.1710 4.6750 1.7258 2.2423 8.4168 6.0783 4.6501 5.2351 2.4138 1.5898 5.1046 4.2918 3.1966 2.6020 4.1866 2.6624 3.1874 2.8516 3.2877 3.0270 2.5427 1.9043 1.7997 1.1830 1.1721 1.5031 1.4208 1.8388 1.2873 1.4046 6.7861 1.5450 1.6713 1.2390 1.3012 1.2128 1.2970 1.3120 1.5452 1.2225 1.2778 1.0798 1.0832 13.4727 13.3280 1.0833 1.0564 1.0621 1.0854 1.0871 1.1059 1.1003 1.0901 1.0685 1.0636 1.0651 1.0666
irintensity: 2.5251 0.1442 0.0794 0.5010 1.2465 5.9004 0.2393 8.9619 8.0130 1.6076 7.9235 44.9863 50.5488 34.6242 12.7645 33.3925 1.6761 27.2410 8.2357 7.6088 44.8936 30.0932 1.6829 166.2231 102.7582 9.3292 8.2292 46.0221 16.3788 22.3752 96.2588 8.5656 3.1247 43.1985 42.0619 9.6869 13.5511 48.0305 8.2855 55.1956 141.9646 20.2274 8.1690 2.7014 41.5344 34.5369 2.4080 87.2460 21.5809 26.8310 27.9005 51.2124 42.2063 16.7261 5.6693 17.0499 3.1575 23.4278 20.6723 6.5768 81.4916 98.1252 39.6948 11.6765 273.4538 442.8528 75.8677 24.2289 49.9257 16.4121 10.7028 14.4646 10.0957 8.2333 249.9099 49.0528 29.0230 13.1648
temp: 298.150 k
press: 1.00000 atm
elementType: 8 8 8 8 7 7 7 7 7 7 6 6 6 6 6 6 1 1 1 1 1 1 1 1 1 1 1 1
symmnumber: 1
zpe: 544866.6 jmol-1
zpe.correction: 0.207529 hartree
zpe.thermalcorrener: 0.225053 hartree
zpe.thermalcorrenthalpy: 0.225997 hartree
zpe.thermalcorrgfe: 0.158513 hartree
zpe.sumelectzpe: -863.830630 hartree
zpe.sumelectthermal: -863.813105 hartree
zpe.sumelectthermalent: -863.812161 hartree
zpe.sumelectthermalfe: -863.879645 hartree
dipole: -1.4024 -4.8106 1.2854
dipole: 5.1731
quadrupole: -91.6326 -101.9922 -97.6136
quadrupole: 1.9551 -9.7359 8.0862
quadrupole: 5.4469 -4.9127 -0.5341 1.9551 -9.7359 8.0862
hfenergy: -864.0381586 hartree
pointgroup: C01 [X(C6H12N6O4)]
dipole: 0.228665 -0.8877448 1.8170894 debye
polarizability: 117.3852079|-1.7228491|107.2134408|23.6826445|-21.2983375|146.4289107 unknown
InChI: InChI=1S/C6H12N6O4/c7-11-9-1-3(13)5(15)6(16)4(14)2-10-12-8/h3-6,13-16H,1-2H2
charge 0 multiplicity 1
28 atoms
O  0.271738 0.070401 2.913634
O  -0.942618 1.447536 1.046749
O  1.775856 2.00993 1.020859
O  -1.084791 -2.274617 0.42873
N  2.098489 0.190473 -1.308403
N  -2.435012 -0.811091 -1.435853
N  2.100879 1.325729 -1.87853
N  -3.231353 -0.476537 -2.357874
N  2.00298 2.277479 -2.579909
N  -3.853684 -0.222777 -3.33622
C  0.764214 -0.237703 1.544778
C  -0.458185 0.095785 0.662893
C  2.032367 0.587371 1.213119
C  -1.586543 -0.954247 0.823835
C  2.82463 0.047584 -0.010462
C  -2.830071 -0.578487 0.000076
H  0.989293 -1.318348 1.462184
H  -0.16429 0.165722 -0.396172
H  2.726422 0.489511 2.080764
H  -1.856132 -1.044516 1.890604
H  3.021673 -1.032552 0.10242
H  3.791429 0.585221 -0.048491
H  -3.098188 0.479895 0.176507
H  -3.677413 -1.237703 0.268147
H  1.023789 0.08541 3.554698
H  -0.967869 1.434147 2.046552
H  0.785378 2.156878 0.93947
H  -1.123988 -2.308394 -0.566706
