program: Gaussian 09
title: 000040524
version: EM64L-G09RevD.01
frameworkgroup: C1[X(C14H25NO)]
method: RPBEPBE
basis: SDD
operation: Freq
keyword: #p
keyword: freq=noraman
keyword: PBEPBE/SDD
title: #p freq=noraman PBEPBE/SDD
converged: NO YES NO NO
title: Mulliken charges:
elementType: O N C C C C C C C C C C C C C C H H H H H H H H H H H H H H H H H H H H H H H H H
charge: -0.443601 -0.293690 0.439617 -0.143428 -0.097185 -0.087873 -0.232101 -0.555778 -0.569373 -0.468385 -0.494417 -0.456850 -0.460108 -0.423985 -0.377171 -0.627072 0.221205 0.198613 0.197236 0.240509 0.200232 0.213030 0.197481 0.211612 0.203698 0.199263 0.210350 0.190764 0.197346 0.195182 0.205528 0.183479 0.223386 0.217982 0.321638 0.177759 0.204290 0.250283 0.223484 0.187755 0.219295
chargesum: 0.00000
title: Mulliken charges with hydrogens summed into heavy atoms:
elementType: O N C C C C C C C C C C C C C C
charge: -0.121963 -0.043407 0.439617 0.077777 0.101428 0.109363 0.008408 -0.142516 -0.160281 -0.065423 -0.093303 -0.064323 -0.071101 0.017383 0.004878 0.003462
polarizability: 1.78746768e+02 -1.00614312e+00 1.36071301e+02 -2.24767144e-01 -5.28779227e-01 1.36224558e+02
1716.lowfreq: -22.7080 -9.9104 -3.5136 -0.0008 -0.0006 -0.0005 33.3530 38.9201 68.4511
frequency: 29.9436 32.7919 67.6188 100.2405 120.8548 151.9937 180.0166 222.5307 231.2831 237.3681 251.0152 276.6861 307.4964 345.4433 368.2878 378.3077 383.3115 420.7489 430.0415 456.7060 482.8403 524.3606 586.9678 631.6398 654.5768 668.2703 719.1143 739.6860 772.8751 798.9695 820.0410 846.0345 863.7542 871.6418 885.0568 916.8222 935.5880 944.5546 957.5306 964.1674 987.2866 999.2502 1027.8112 1032.3609 1047.4267 1056.8483 1062.6580 1067.9656 1088.4586 1096.7020 1099.2246 1108.0729 1114.6252 1126.1048 1137.6287 1153.8308 1163.8363 1179.1331 1196.5163 1202.7494 1227.0521 1243.8959 1265.1947 1275.4360 1278.2260 1282.1631 1291.1374 1300.6767 1306.6660 1313.1948 1313.9506 1324.2878 1337.4937 1340.6910 1345.0594 1352.3678 1358.9023 1364.0909 1371.4694 1377.5553 1433.7604 1445.4445 1449.5971 1457.8383 1458.9923 1463.7067 1467.2718 1470.6806 1474.5400 1486.1158 1488.3476 1497.9876 2834.8854 2863.9222 2944.5833 2949.7463 2952.3009 2961.3912 2962.1864 2966.5271 2973.8966 2986.2755 2991.7248 2998.2305 3003.0177 3006.5581 3008.0497 3008.2907 3014.6394 3018.4660 3024.5752 3026.9160 3031.2862 3047.8091 3071.4097 3441.5274 3555.8326
redmass: 1.7874 3.5950 3.3441 2.5021 2.0430 4.0757 3.1603 1.1587 2.1684 1.2941 2.3856 3.7851 2.4058 3.0776 2.3436 2.8519 3.2559 2.0719 1.8650 2.9967 2.7825 4.1169 3.1156 4.2637 3.2619 1.4450 2.9342 1.2465 3.3943 2.3317 2.4739 1.5034 1.6178 1.5611 2.7395 2.4500 2.0711 1.9817 2.0606 2.1276 2.5308 3.2493 1.9628 2.8351 1.7834 1.6870 2.6863 1.5962 1.4522 1.3578 1.3778 1.0579 1.1440 1.5089 2.8580 1.3637 3.0381 1.4325 1.1758 1.4106 1.7045 1.4079 1.5976 1.3152 1.6518 1.7693 1.4341 2.0419 1.6916 1.4324 1.6518 1.3210 1.4506 1.4089 1.4632 1.4313 1.5041 1.5911 1.4663 1.1951 1.1470 1.2076 1.0803 1.0862 1.0837 1.0717 1.0797 1.0868 1.0881 1.0868 1.0669 1.0691 1.0711 1.0570 1.0618 1.0618 1.0644 1.0626 1.0608 1.0610 1.0654 1.0804 1.0848 1.0844 1.0972 1.0900 1.0935 1.0747 1.0956 1.1022 1.0983 1.1001 1.0918 1.1024 1.0993 1.0743 1.0652
irintensity: 1.6742 0.8570 0.7332 0.8607 2.4254 1.4113 2.0063 89.7648 16.8752 0.9553 0.7388 18.6367 2.7736 1.5937 3.5318 0.4754 3.1681 0.2219 0.3934 6.2045 3.4728 1.1225 7.4203 3.3202 18.0023 96.0428 3.6729 2.1754 1.5750 8.5004 5.4162 0.9192 2.2101 0.0059 21.9413 4.4441 1.9896 2.0110 5.1555 1.7663 27.2724 53.0447 15.4904 0.3028 3.6383 0.2311 0.5557 0.9040 8.1780 6.1162 0.6935 1.5538 0.4757 13.8004 4.6366 3.5269 26.7642 16.3931 1.5303 15.7725 4.7633 1.6780 3.0785 4.8124 2.2690 0.8834 2.4313 3.6046 0.0357 0.1830 3.6213 0.0619 1.0011 0.3474 1.8986 0.3281 6.1044 2.8601 12.3370 23.9636 1.9215 20.7193 2.5671 4.7638 3.2936 12.0586 4.3295 21.4264 19.3149 8.6037 13.1839 5.4786 83.6217 181.4974 20.0791 39.2052 44.1190 30.2665 35.6345 33.3552 13.6780 42.4758 146.2572 92.3069 28.6112 16.4525 44.6516 42.5883 29.6259 5.3731 26.3497 93.3286 84.7759 66.9562 42.1614 1.4280 1.7185
temp: 298.150 k
press: 1.00000 atm
elementType: 8 7 6 6 6 6 6 6 6 6 6 6 6 6 6 6 1 1 1 1 1 1 1 1 1 1 1 1 1 1 1 1 1 1 1 1 1 1 1 1 1
symmnumber: 1
zpe: 969175.6 jmol-1
zpe.correction: 0.369139 hartree
zpe.thermalcorrener: 0.384995 hartree
zpe.thermalcorrenthalpy: 0.385939 hartree
zpe.thermalcorrgfe: 0.325828 hartree
zpe.sumelectzpe: -677.168858 hartree
zpe.sumelectthermal: -677.153002 hartree
zpe.sumelectthermalent: -677.152058 hartree
zpe.sumelectthermalfe: -677.212169 hartree
dipole: 1.5385 -0.4459 -1.1034
dipole: 1.9450
quadrupole: -95.2970 -103.4624 -98.5389
quadrupole: -2.0535 1.3616 -0.5207
quadrupole: 3.8024 -4.3629 0.5606 -2.0535 1.3616 -0.5207
hfenergy: -677.5379974 hartree
pointgroup: C01 [X(C14H25N1O1)]
dipole: 0.606822 0.1265085 0.4487218 debye
polarizability: 178.7055317|1.675133|136.257171|0.027571|-0.5375815|136.0799249 unknown
InChI: InChI=1S/C14H25NO/c1-15-4-2-3-14-8-10-5-11(9-14)7-12(6-10)13(14)16/h10-13,15-16H,2-9H2,1H3
charge 0 multiplicity 1
41 atoms
O  0.217089 -2.324219 -0.368686
N  -4.747383 0.092526 -0.555469
C  0.281622 0.083399 0.416033
C  2.07546 -0.834466 -1.166258
C  2.055774 1.636759 -0.598258
C  2.738201 -0.060565 1.155965
C  0.589839 -0.938982 -0.725969
C  0.577326 1.509938 -0.14385
C  1.258296 -0.178339 1.605716
C  2.33554 0.595259 -1.715042
C  3.01894 -1.10066 0.038274
C  2.996352 1.368524 0.606868
C  -1.181509 -0.03893 0.925584
C  -2.291912 0.06869 -0.143145
C  -3.699032 0.053134 0.485326
C  -6.127187 0.092461 -0.036847
H  2.253024 -1.58607 -1.959733
H  2.233551 2.657939 -0.989751
H  3.404022 -0.252382 2.020809
H  -0.059341 -0.7293 -1.595715
H  0.35455 2.258785 0.64398
H  -0.093448 1.731594 -0.997371
H  1.068456 -1.18162 2.04444
H  1.047343 0.553568 2.41156
H  1.683603 0.791408 -2.590042
H  3.384316 0.677662 -2.063792
H  4.073068 -1.031512 -0.295299
H  2.887145 -2.132154 0.428858
H  4.055015 1.470654 0.293834
H  2.815703 2.118206 1.403482
H  -1.290164 -1.014248 1.441264
H  -1.339815 0.747759 1.694975
H  -2.192062 0.995974 -0.738264
H  -2.206026 -0.784342 -0.846291
H  0.797502 -2.626722 0.37495
H  -3.791182 -0.840104 1.158194
H  -3.826406 0.946729 1.130299
H  -4.599163 -0.645514 -1.257287
H  -6.304622 1.020075 0.539521
H  -6.368664 -0.768385 0.636128
H  -6.843224 0.081971 -0.877991
